{"text_format":"1","workbook":"xlsx","n_sheets":6,"sheets":["DADOS","QCI","CRONO","RRE","Ofício","Listas"],"not_rendered":{"charts":0,"images":5,"macros":1,"external_links":0,"defined_names":102,"comments":3,"pivot_tables":0},"unopened":[],"bounds":{"document_bytes":16777216,"sheet_cells":100000,"rows_first":2000,"rows_last":500,"rows_between":2000,"halvings":0,"cell_chars":16384,"cell_head_chars":4096},"cells_cut":0,"cells_raw":0,"read":"whole","date_system":"1900"}

{"sheet":"DADOS","index":0,"n_rows":81,"n_cols":10,"rows_kept":81,"cut":false,"hidden":false,"merged":[[69,2,69,4],[73,2,73,4],[74,2,74,4],[75,2,75,4],[76,2,76,4],[70,2,70,4],[71,2,71,4],[72,2,72,4],[55,2,55,4],[56,2,56,4],[68,2,68,4],[57,2,57,4],[58,2,58,4],[59,2,59,4],[60,2,60,4],[64,2,64,4],[65,2,65,4],[66,2,66,4],[67,2,67,4],[61,2,61,4],[62,2,62,4],[63,2,63,4],[24,7,24,9],[26,5,26,6],[24,5,24,6],[21,4,21,5],[53,2,53,4],[27,5,27,6],[27,0,27,4],[23,0,23,3],[24,0,24,3],[26,0,26,4],[21,2,21,3],[20,4,20,5],[20,6,20,8],[23,5,23,6],[21,6,21,8],[20,2,20,3],[0,1,1,9],[10,0,10,9],[12,0,12,9],[2,0,2,9],[8,0,8,5],[4,0,4,9],[6,0,6,9]]}
[41211,"QCI - Quadro de Composição do Investimento / RRE - Relatório Resumo do Empreendimento"]
["v009"]
["INSTRUÇÕES DE USO E PREENCHIMENTO"]
[]
["1. Este documento somente pode ser utilizado nas versões do Excel 2003 ou superior. Não deve ser utilizado versões do BROffice. O Documento deve ser salvo SOMENTE em extensão habilitada para macros (.xls ou .xlsm). Se o documento for salvo na extensão .xlsx, o arquivo será INUTILIZADO."]
[]
["2. Para funcionamento pleno desse arquivo, a Segurança de Macros do Excel deve ser habilitada."]
["2.1  Na Versão Excel 2003, selecione na Faixa de Opções: Ferramentas --> Macro --> Segurança --> Na aba Nível de Segurança selecione a Opção \"Baixo\" --> Clique em OK --> Feche e abra o Excel novamente para utilizar a Planilha."]
["2.2 Na Versão Excel 2007 ou superior, selecione na Faixa de Opções: Arquivo --> Opções --> Central de Confiabilidade --> Configurações da Central de Confiabilidade --> Configurações de Macro --> Habilitar todas as Macros --> Clique em OK --> Feche e abra o excel novamente para utilizar a Planilha."]
[]
{"$rows_left_out":72}
{"sheet":"QCI","index":1,"n_rows":37,"n_cols":35,"rows_kept":37,"cut":false,"hidden":false,"merged":[[8,34,9,34],[8,16,9,16],[8,11,9,11],[8,12,9,12],[8,21,9,21],[8,23,9,23],[8,33,9,33],[8,24,9,24],[8,18,9,18],[2,1,2,13],[8,13,9,13],[5,10,6,10],[8,1,9,1],[8,7,9,7],[8,8,9,8],[8,9,9,9],[8,2,9,3],[8,6,9,6],[8,5,9,5],[5,6,6,9],[8,4,9,4],[13,30,13,31],[14,30,14,31],[8,10,9,10],[8,22,9,22],[8,17,9,17],[8,14,9,14],[9,26,9,28],[8,19,9,19],[13,2,14,3],[31,8,33,9],[36,3,36,5],[36,8,36,11],[35,8,35,11],[34,2,34,5],[35,3,35,5],[27,1,27,3],[28,1,29,14]]}
[null,null,null,null,null,null,null,null,null,null,null,null,null,null,null,null,"sumvalue1",null,null,null,null,null,null,"sumheight1"]
[null,null,null,null,null,null,null,null,null,null,null,null,null,null,"Grau de Sigilo"]
[null,"QCI - QUADRO DE COMPOSIÇÃO DO INVESTIMENTO",null,null,null,null,null,null,null,null,null,null,null,null,"#PUBLICO"]
[]
[]
[null,null,null,null,null,null,{"$f":"CHOOSE(1+LOG(1+2*(OR(AND($O$15>0,$M$14<$Z$7),$M$15<ROUND($AA$7*$O$15,2)))+4*OR($L$7<0,$M$7<0)+8*(COUNTIF($L$15:$L$35,\"<0\")>0),2),\"\",\"ERRO: CONTRAPARTIDA MENOR QUE A MÍNIMA\",\"ERRO: SALDO NEGATIVO\",\"ERRO: VALORES DE REPASSE NEGATIVOS\")","v":""},null,null,null,"Saldo a Reprogramar",{"$f":"CRONO!$J$11","v":"Repasse (R$)"},"Contrapartida (R$)",null,null,null,null,null,"% Rateio CP Fin:",null,null,null,null,null,null,"% CP Min Prog:","% CP Absoluta:","% CP Max Rep:","% Maior:"]
[null,null,null,null,null,null,null,null,null,null,null,{"$f":"DADOS!H$28-L$15","v":0},{"$f":"DADOS!I$28-M$15","v":0},null,null,null,null,null,{"$f":"IF(OR($O$15=CalculadoInv,$O$15=0),0,MIN(MAX(0,($AC$7*$O$15-CalculadoCPFin)/($O$15-CalculadoInv)),1))","v":4.3367979742203119E-2},null,null,null,null,null,null,{"$f":"ROUND(DADOS!$B$37,4)","v":1E-3},{"$f":"IF($O$15=0,0,DADOS!$C$37/$O$15)","v":0},{"$f":"IF($O$15=0,0,($O$15-$AC$15-DADOS!$H$28)/$O$15)","v":4.3367979742203119E-2},{"$f":"MAX(Z7:AB7)","v":4.3367979742203119E-2}]
[]
[null,"Etapa","Meta / \nSub-Meta",null,"Item de Investimento","Sub-Item de Investimento","Descrição da Meta / Sub-Meta","Situação","Quantidade","Unid.","Lote de Licitação / nº CTEF",{"$f":"IF(DADOS!$J$22=\"FGTS\",\"Financiamento\",\"Repasse\")","v":"Repasse"},"Contrapartida Financeira","Outros","Investimento",null,"Investimento","Divisão do Investimento","Contrapartida Financeira",{"$f":"N9","v":"Outros"},null,"Nº Meta","Nº Sub-Meta","Altura","Somar Meta",null,null,null,null,null,null,null,null,"Lotes","Total Etapa"]
[null,null,null,null,null,null,null,null,null,null,null,null,null,null,null,null,null,null,null,null,null,null,null,null,null,null,"Valores Previstos"]
{"$rows_left_out":28}
{"sheet":"CRONO","index":2,"n_rows":79,"n_cols":24,"rows_kept":79,"cut":false,"hidden":false,"merged":[[4,4,5,6],[19,7,20,7],[14,7,18,7],[7,4,8,4],[7,5,8,6],[19,4,20,4],[29,8,33,8],[39,8,43,8],[54,8,58,8],[24,4,25,4],[24,5,25,5],[24,6,25,6],[24,7,25,7],[34,5,35,5],[34,6,35,6],[39,6,40,6],[44,5,45,5],[44,6,45,6],[39,5,40,5],[49,4,50,4],[49,5,50,5],[49,6,50,6],[1,10,1,16],[2,10,2,16],[7,8,8,8],[9,7,13,7],[7,7,8,7],[19,8,23,8],[49,7,50,7],[39,7,40,7],[44,4,45,4],[29,4,30,4],[29,5,30,5],[29,6,30,6],[29,7,30,7],[34,4,35,4],[49,8,53,8],[44,8,48,8],[44,7,45,7],[19,5,20,5],[19,6,20,6],[34,8,38,8],[24,8,28,8],[78,13,78,15],[76,4,76,6],[76,7,76,9],[76,12,76,15],[77,4,77,6],[77,13,77,15],[77,7,77,9],[64,7,65,7],[59,7,60,7],[59,8,63,8],[72,4,73,9],[64,4,65,4],[64,5,65,5],[64,6,65,6],[71,4,71,6],[64,8,68,8],[59,4,60,4],[59,5,60,5],[59,6,60,6],[39,4,40,4],[34,7,35,7],[54,4,55,4],[54,5,55,5],[54,6,55,6],[54,7,55,7]]}
[null,null,null,null,null,null,null,null,null,null,null,null,null,null,null,null,null,{"$f":"QCI!$O$2","v":"Grau de Sigilo"}]
[null,null,null,null,null,null,null,null,null,null,"CFF-CT - CRONOGRAMA FÍSICO FINANCEIRO DO CONTRATO",null,null,null,null,null,null,{"$f":"QCI!$O$3","v":"#PUBLICO"}]
[]
[]
[null,"Informação da 1ª Coluna",null,null,{"$f":"CHOOSE(1+LOG(1+2*(OFFSET(S16,0,-1)<>$I$16)+4*(COUNTIF($K$15:$S$15,\">1\")>0)+8*(OFFSET(S19,0,-1)<>$I$19)+16*(ROUND($I$19,2)=0),2),\"\",\"ERRO: DIVISÃO DO INVESTIMENTO NÃO CONFERE\",\"ERRO: PARCELAS MAIORES QUE 100%\",\"ERRO: CRONOGRAMA NÃO FECHA EM 100%\",\"\")","v":""},null,null,null,{"$f":"IF($B$6=2,\"Qtde de Medições realizadas\",\"\")","v":""},{"$f":"IF($B$6=2,\"Reinício Previsto\",\"Início Previsto\")","v":"Início Previsto"}]
[null,1,null,null,null,null,null,null,1,"2017-12-01"]
[null,null,null,null,null,null,null,null,null,{"$f":"IF(AND($B$6=2,$I$6>0),$I$6-1,0)","v":0},{"$f":"OFFSET(K7,0,-1)+1","v":1},2,3,4,5,6,7,8,null,null,null,null,null,{"$f":"OFFSET(X7,0,-1)+1","v":1}]
[null,null,null,null,"Etapa","Meta / \nSub-Meta",null,"Descrição da Meta / Sub-Meta","Valores Totais (R$)",null,{"$f":"IF(K7=0,CONCATENATE(\"Parcela \",$I$6),CONCATENATE(\"Parcela \",K7))","v":"Parcela 1"},{"$f":"IF(L7=0,CONCATENATE(\"Parcela \",$I$6),CONCATENATE(\"Parcela \",L7))","v":"Parcela 2"},{"$f":"IF(M7=0,CONCATENATE(\"Parcela \",$I$6),CONCATENATE(\"Parcela \",M7))","v":"Parcela 3"},"Parcela 4","Parcela 5","Parcela 6","Parcela 7","Parcela 8",null,null,null,null,null,{"$f":"IF(X7=0,CONCATENATE(\"Parcela \",$I$6),CONCATENATE(\"Parcela \",X7))","v":"Parcela 1"}]
["Altura","SOMASE","Valores",null,null,null,null,null,null,null,{"$f":"IF(AND($B$6=2,$I$6>0,J8=0),\"Executado\",DATE(YEAR($J$6),MONTH($J$6)+K7-IF(AND($B$6=2,$I$6>0),$I$6,0),1))","v":"2018-01-01"},"2018-02-01","2018-03-01","2018-04-01","2018-05-01","2018-06-01","2018-07-01","2018-08-01",null,null,null,null,null,{"$f":"IF(AND($B$6=2,$I$6>0,W8=0),\"Executado\",DATE(YEAR($J$6),MONTH($J$6)+X7-IF(AND($B$6=2,$I$6>0),$I$6,0),1))","v":"2018-01-01"}]
[null,null,null,null,null,null,null,"Parcela",0,"(%)",{"$f":"IF(COLUMN()-COLUMN($J$8)>1,K15-J15,K15)","v":0.36859999999999998},0.43790000000000001,0.19350000000000001,0,0,0,0,0,null,null,null,null,null,{"$f":"IF(COLUMN()-COLUMN($J$8)>1,X15-W15,X15)","v":1}]
{"$rows_left_out":70}
{"sheet":"RRE","index":3,"n_rows":42,"n_cols":52,"rows_kept":42,"cut":false,"hidden":false,"merged":[[41,8,41,16],[38,7,38,16],[27,0,27,2],[8,0,9,0],[28,0,29,17],[13,7,13,8],[8,16,9,16],[34,8,34,16],[8,13,9,13],[11,17,14,17],[8,7,9,7],[11,11,14,11],[39,8,39,16],[35,8,35,16],[11,7,11,8],[36,8,36,16],[41,2,41,4],[34,2,34,4],[35,2,35,4],[36,2,36,4],[39,2,39,4],[12,7,12,8],[6,7,7,9],[8,1,9,2],[40,2,40,4],[38,0,38,4],[40,8,40,16],[33,7,33,16],[11,10,14,10],[14,7,14,8],[33,0,33,4],[31,1,31,4],[11,1,14,2],[1,16,1,17],[2,16,2,17],[2,0,2,13],[8,8,9,8],[4,4,4,5],[4,13,4,14],[4,8,5,8],[4,7,5,7],[5,13,5,14],[8,3,9,3],[8,5,9,5],[8,6,9,6],[4,9,5,9],[7,12,7,16],[8,4,9,4],[8,19,9,19],[8,20,9,20],[31,9,31,16],[7,17,9,17],[8,14,9,15],[8,12,9,12],[8,10,9,11],[11,15,14,15],[11,14,14,14],[7,25,7,26],[8,39,9,39],[8,31,9,31],[8,32,9,32],[8,29,9,29],[7,34,7,36],[8,26,9,26],[8,34,9,34],[8,25,9,25],[7,31,7,33],[8,28,9,28],[8,33,9,33],[8,37,9,37],[8,35,9,35],[7,28,7,30],[8,30,9,30],[8,36,9,36],[7,37,7,39],[8,38,9,38],[8,49,9,49],[8,40,9,40],[7,49,7,51],[8,50,9,50],[8,51,9,51],[8,42,9,42],[8,45,9,45],[8,43,9,43],[7,43,7,45],[8,44,9,44],[7,46,7,48],[7,40,7,42],[8,41,9,41],[8,48,9,48],[8,47,9,47],[8,46,9,46]]}
[null,null,null,null,null,null,null,null,null,null,null,null,null,null,null,null,null,null,null,"RRET"]
[null,null,null,null,null,null,null,null,null,null,null,null,null,null,null,null,{"$f":"QCI!O2","v":"Grau de Sigilo"}]
[{"$f":"CONCATENATE(\"RRE - RELATÓRIO RESUMO DO EMPREENDIMENTO - \",IF(RREMode=\"RRET\",\"TOMADOR\",\"CAIXA\"))","v":"RRE - RELATÓRIO RESUMO DO EMPREENDIMENTO - TOMADOR"},null,null,null,null,null,null,null,null,null,null,null,null,null,null,null,{"$f":"QCI!O3","v":"#PUBLICO"}]
[null,null,null,null,null,null,null,null,null,null,null,null,null,null,null,null,null,null,null,null,null,null,"Acum. Previsto","Acum. Chegada",null,"Vmax","Vmax",null,"Vmax","Vmax","Vmax","Vmax","Vmax","Vmax","Vmax","Vmax","Vmax","Vmax","Vmax","Vmax","Vmax","Vmax","Vmax","Vmax","Vmax","Vmax","Vmax","Vmax","Vmax","Vmax","Vmax","Vmax"]
[null,null,null,"Situação do TC/CR:","Percentual previsto em:",null,null,"Medição nº:",1,"Saldo a Reprogramar:",null,null,{"$f":"CRONO!$J$11","v":"Repasse (R$)"},"Contrapartida (R$)",null,null,null,null,null,null,null,"Repasse",{"$f":"W8-W7-W6","v":0},{"$f":"X8-X7-X6","v":0}]
[null,null,null,{"$f":"IF(F6=\"-\",\"-\",IF(R12<F6,\"Atrasada\",IF(R12>F6,\"Adiantada\",\"Normal\")))","v":"Atrasada"},{"$f":"DATE(YEAR(J32),MONTH(J32),1)","v":"2018-01-01"},{"$f":"IF($E$6<=DATE(YEAR(CRONO!$J$6),MONTH(CRONO!$J$6),1),\"-\",IF(COUNTIF(CRONO!$K$9:$S$9,RRE!$E$6)=0,1,HLOOKUP(RRE!$E$6,CRONO!$K$9:$S$16,7)))","v":0.36859999999999998},null,null,null,null,null,null,{"$f":"QCI!L7","v":0},{"$f":"QCI!M7","v":0},null,null,null,null,null,null,null,"CP. Financ.",{"$f":"ROUND(SUMIF($V$15:$V$26,TRUE,$O$15:$O$26),2)","v":0},{"$f":"IF(OR($Q$15<$M$15,$M13>$W6),MIN($M13,$J13),MIN($W6,$N$15-$N$14+$M13))","v":0},null,{"$f":"MIN($J$13,$Q$15-Z$14)","v":0},{"$f":"MIN($J$13,$Q$15-AA$14)","v":0},null,{"$f":"MIN($J$13,$Q$15-AC$14)","v":0},0,0,0,0,0,0,0,0,0,0,0,0,0,0,0,0,0,0,0,0,0,0,0]
[null,null,null,null,null,null,null,{"$f":"\"Acumulado Anterior:  \"&TEXT(M15/(J15+10^-12),\"0,00%\")","v":"Acumulado Anterior:  0,00%"},null,null,null,null,null,null,null,null,null,null,null,null,null,{"$f":"$H$14","v":"Outros"},{"$f":"ROUND(SUMIF($V$15:$V$26,TRUE,$P$15:$P$26),2)","v":0},{"$f":"IF(OR($Q$15<$M$15,$M14>$W7),MIN($M14,$J14),MIN($W7,$N$15+$M14))","v":0},null,{"$f":"MIN($J$14,$Q$15-Z$13)","v":0},{"$f":"MIN($J$14,$Q$15-AA$13)","v":0},null,{"$f":"MIN($J$14,$Q$15-AC$13)","v":0},0,0,0,0,0,0,0,0,0,0,0,0,0,0,0,0,0,0,0,0,0,0,0]
[null,null,null,null,null,null,null,null,null,null,null,null,{"$f":"IF(RREMode=\"RRET\",\"Valores Medidos (R$)\",\"Valores Aferidos (R$)\")","v":"Valores Medidos (R$)"},null,null,null,null,"Execução Física Acum.",null,null,null,"Investimento",{"$f":"Q15","v":0},{"$f":"W8","v":0},null,"Valores Aferidos Acumulados (R$)",null,null,"Valores Medidos Acumulados (R$)",null,null,"Valores Medidos Acumulados (R$)",null,null,"Valores Medidos Acumulados (R$)",null,null,"Valores Medidos Acumulados (R$)",null,null,"Valores Medidos Acumulados (R$)",null,null,"Valores Medidos Acumulados (R$)",null,null,"Valores Medidos Acumulados (R$)",null,null,"Valores Medidos Acumulados (R$)"]
["Etapa","Meta / \nSub-Meta",null,"Descrição da Meta / Sub-Meta","Situação","Quantidade","Unid.","Lote de Licitação\n / nº CTEF","nº do BM","Valor Total (R$)","Acum. Período Anterior",null,"Acum. Período Anterior","No Período","Acum. Incluindo o Período",null,"Acum. incluindo o Período",null,null,"Altura","Rel. Forn.",null,null,null,null,"Aferição Anterior","Aferição Atual",null,1,{"$f":"OFFSET(AD9,0,-1)+1","v":2},{"$f":"OFFSET(AE9,0,-1)+1","v":3},4,5,6,7,8,9,10,11,12,13,14,15,16,17,18,19,20,21,22,23,{"$f":"OFFSET(AZ9,0,-1)+1","v":24}]
[null,null,null,null,null,null,null,null,null,null,null,null,null,null,null,null,null,null,null,null,null,"Somar Meta","Medição Ant.","Medição Acum."]
{"$rows_left_out":33}
{"sheet":"Ofício","index":4,"n_rows":54,"n_cols":13,"rows_kept":54,"cut":false,"hidden":false,"merged":[[2,6,2,9],[6,6,6,9],[12,1,12,5],[5,1,5,2],[6,0,6,5],[8,0,8,2],[9,6,9,7],[0,0,3,1],[9,1,9,2],[13,1,13,5],[35,0,35,5],[36,0,36,5],[32,4,32,5],[26,2,27,2],[15,1,15,5],[31,0,31,1],[22,0,24,5],[16,1,16,5],[28,4,28,5],[53,0,54,5],[15,7,15,9],[17,7,18,9],[17,6,18,6],[16,7,16,9],[53,6,54,9],[20,6,21,9],[52,6,52,9],[17,1,18,5],[17,0,18,0],[26,3,27,3],[26,4,27,5],[29,0,29,1],[29,4,29,5],[28,0,28,1],[26,0,27,1],[52,0,52,5],[30,0,30,1],[30,4,30,5],[31,4,31,5],[32,0,32,1],[37,0,38,5],[40,0,44,5]]}
[null,null,null,null,null,"Grau de Sigilo"]
[null,null,null,null,null,"# PÚBLICO"]
[]
[]
[]
["Ofício n°:",null,null,null,""]
[{"$f":"CONCATENATE(RRE!$B$32,\", \",TEXT(RRE!$J$32,\"dd\"\" de \"\"mmmm\"\" de \"\"aaaa\"))","v":", 25 de janeiro de 2018"},null,null,null,null,null,{"$f":"A7","v":", 25 de janeiro de 2018"}]
["À",null,null,null,null,null,"À"]
["CAIXA ECONÔMICA FEDERAL",null,null,null,null,null,"CAIXA ECONÔMICA FEDERAL"]
["GIGOV",null,null,null,null,null,{"$f":"CONCATENATE(A10,\" \",B10)","v":"GIGOV "}]
{"$rows_left_out":45}
{"sheet":"Listas","index":5,"n_rows":19,"n_cols":36,"rows_kept":19,"cut":false,"hidden":true,"merged":[[0,3,0,35]]}
[null,null,null,"Sub-Itens de Investimento"]
[null,"Itens de Investimento","Unidades habitacionais",{"$f":"COUNTA(C:C)-1","v":3},"Equipamentos comunitários",{"$f":"COUNTA(E:E)-1","v":6},"Pavimentação",{"$f":"COUNTA(G:G)-1","v":6},"Drenagem ",{"$f":"COUNTA(I:I)-1","v":6},"Abastecimento de água",{"$f":"COUNTA(K:K)-1","v":11},"Esgotamento sanitário",{"$f":"COUNTA(M:M)-1","v":8},"Energia elétrica e iluminação pública",{"$f":"COUNTA(O:O)-1","v":4},"Coleta e tratamento de resíduos sólidos",{"$f":"COUNTA(Q:Q)-1","v":6},"Contenção e estabilização de encostas ",{"$f":"COUNTA(S:S)-1","v":2},"Regularização fundiária",{"$f":"COUNTA(U:U)-1","v":2},"Aquisição de terreno",{"$f":"COUNTA(W:W)-1","v":2},"Aquisição de equipamentos e insumos",{"$f":"COUNTA(Y:Y)-1","v":1},"Elaboração de estudos e projetos",{"$f":"COUNTA(AA:AA)-1","v":1},"Instrumentos e ações em planejamento e gestão pública",{"$f":"COUNTA(AC:AC)-1","v":1},"Ações complementares às obras",{"$f":"COUNTA(AE:AE)-1","v":3},"Gerenciamento",{"$f":"COUNTA(AG:AG)-1","v":1},"Trabalho social",{"$f":"COUNTA(AI:AI)-1","v":4}]
[null,"Unidades habitacionais","Aquisição","un","Convivência comunitária, assistência social e/ou comunitária","m²","Capeamento de vias","m²","Obras de microdrenagem ","m","Captação subterrânea","m³/s","Ligações domiciliares e/ou intradomiciliares","un","Iluminação pública - luminárias","un","Acondicionamento ","un","Estabilização de taludes","m²","Desapropriacões/Indenizações","m²","Aquisição de terreno","m²","Aquisição de equipamentos e insumos","un","Elaboração de estudos e projetos","un","Instrumentos e ações em planejamento e gestão pública","un","Avaliação pós intervenção","un","Gerenciamento","%CT","Projeto de Trabalho Social Preliminar","nº fam"]
[null,"Equipamentos comunitários","Construção","un","Educação e cultura","m²","Recapeamento de vias","m²","Desassoreamento de cursos de água","m","Captação superficial","m³/s","Rede coletora e/ou condominial","m","Ligações domiciliares","un","Aterro sanitário e/ou disposição final","m³","Obras complementares a ações de redução de risco e/ou contenções","m²","Projeto de Regularização Fundiária","m²","Benfeitorias","m²",null,null,null,null,null,null,"Demolições","un",null,null,"Projeto de Trabalho Social","nº fam"]
[null,"Pavimentação","Reforma e/ou melhoria","un","Esportes","m²","Obras de artes especiais","m","Canalização de cursos de água","m","Estação de bombeamento de água bruta","m³/s","Coletor tronco e/ou interceptores","m","Linhas de distribuição - baixa tensão ","m","Erradicação de lixões","m³",null,null,null,null,null,null,null,null,null,null,null,null,"Plano de Reassentamento e medidas compensatórias","un",null,null,"Plano de Desenvolvimento Socioterritorial","nº fam"]
[null,"Drenagem ",null,null,"Lazer e turismo","m²","Pavimentação de calçadas","m²","Recomposição de vegetação ciliar, renaturalização de cursos de água ou restauração de margens","m²","Adução","m","Emissário","m","Linhas de transmissão - alta tensão ","m","Sistema de coleta seletiva tradicional, transporte e/ou equipamentos","un",null,null,null,null,null,null,null,null,null,null,null,null,null,null,null,null,"Plano de Gestão Condominial","nº fam"]
[null,"Abastecimento de água",null,null,"Saúde","m²","Pavimentação de vias","m²","Reservatório de amortecimento de cheias","m³","Estação de Tratamento de Água (ETA)","m³/s","Estação Elevatória","m³/s",null,null,"Tratamento local ","un"]
[null,"Esgotamento sanitário",null,null,"Segurança pública","m²","Sinalização","m²","Estação de Bombeamento","m³/s","Estação de bombeamento de água tratada","m³/s","Estação de Tratamento de Esgoto (ETE)","m³/s",null,null,"Usinas de reciclagem ","m²"]
[null,"Energia elétrica e iluminação pública",null,null,null,null,null,null,null,null,"Linha de recalque","m","Sistema simplificado de tratamento","m³/s"]
[null,"Coleta e tratamento de resíduos sólidos",null,null,null,null,null,null,null,null,"Reservação","m³","Unidades sanitárias","un"]
{"$rows_left_out":9}