{"text_format":"1","workbook":"xlsx","n_sheets":5,"sheets":["DADOS","BDI (1)","PO","PLQ","CFF"],"not_rendered":{"charts":0,"images":21,"macros":1,"external_links":0,"defined_names":122,"comments":0,"pivot_tables":0},"unopened":[],"bounds":{"document_bytes":16777216,"sheet_cells":100000,"rows_first":2000,"rows_last":500,"rows_between":2000,"halvings":0,"cell_chars":16384,"cell_head_chars":4096},"cells_cut":0,"cells_raw":0,"read":"whole","date_system":"1900"}

{"sheet":"DADOS","index":0,"n_rows":230,"n_cols":24,"rows_kept":230,"cut":false,"hidden":false,"merged":[[37,6,37,18],[85,0,85,23],[37,3,37,5],[41,2,41,6],[67,0,67,23],[77,0,77,23],[70,0,70,23],[71,0,71,23],[15,0,15,23],[17,0,17,23],[21,0,21,8],[75,0,75,23],[83,0,83,23],[76,0,76,23],[78,0,78,23],[81,0,81,23],[219,9,219,14],[98,0,98,23],[97,0,97,23],[96,0,96,23],[25,0,25,23],[27,0,27,1],[28,0,28,1],[68,0,68,23],[59,0,59,23],[61,0,61,23],[100,0,100,23],[94,0,94,23],[95,0,95,23],[37,0,37,1],[41,20,41,21],[69,0,69,23],[39,0,39,23],[99,0,99,23],[73,0,73,23],[80,0,80,23],[89,0,89,23],[92,0,92,23],[93,0,93,23],[91,0,91,23],[0,1,1,23],[55,7,55,10],[41,22,41,23],[36,0,36,1],[41,0,41,1],[42,22,42,23],[42,14,42,19],[42,2,42,6],[41,10,41,12],[42,20,42,21],[34,0,34,23],[36,6,36,18],[36,3,36,5],[3,0,3,23],[5,0,5,23],[7,0,7,23],[23,0,23,23],[13,0,13,23],[9,0,9,23],[11,0,11,23],[41,7,41,8],[55,1,55,4],[41,14,41,19],[42,0,42,1],[223,0,223,5],[223,6,223,9],[222,6,222,9],[219,2,219,4],[86,0,86,23],[228,22,228,23],[228,20,228,21],[42,7,42,8],[226,0,226,1],[225,6,225,18],[225,0,225,1],[219,0,219,1],[226,3,226,5],[47,0,47,2],[56,7,56,10],[53,1,53,4],[64,0,64,23],[54,7,54,10],[44,0,44,23],[62,0,62,23],[49,0,49,23],[54,1,54,4],[56,1,56,4],[53,7,53,10],[229,14,229,19],[228,7,228,8],[228,10,228,12],[228,14,228,19],[229,22,229,23],[223,16,223,23],[222,10,222,15],[79,0,79,23],[82,0,82,23],[229,0,229,1],[229,20,229,21],[229,10,229,12],[220,9,220,14],[226,6,226,18],[228,0,228,1],[228,2,228,6],[229,2,229,6],[229,7,229,8],[223,10,223,15],[222,16,222,23],[225,3,225,5],[84,0,84,23],[220,0,220,1],[222,0,222,5],[220,2,220,4],[219,5,219,8],[220,5,220,8],[219,15,219,23],[220,15,220,23],[27,9,27,14],[31,6,31,9],[30,10,30,15],[31,10,31,15],[27,15,27,23],[30,16,30,23],[31,16,31,23],[30,0,30,5],[27,2,27,4],[28,2,28,4],[27,5,27,8],[28,5,28,8],[31,0,31,5],[30,6,30,9],[28,15,28,23],[28,9,28,14],[66,0,66,23],[87,0,87,23],[42,10,42,12]]}
[27476,"PO - Planilha Orçamentária / PLQ - Planilha de Levantamento de Quantidades / CFF - Cronograma Físico Financeiro"]
["v008"]
[]
["INSTRUÇÕES DE USO E PREENCHIMENTO"]
[]
["1. Este documento somente pode ser utilizado nas versões do Excel 2003 ou superior. Não deve ser utilizado versões do BROffice. O Documento deve ser salvo SOMENTE em extensão habilitada para macros (.xls ou .xlsm). Se o documento for salvo na extensão .xlsx, o arquivo será INUTILIZADO. "]
[]
["2. Para funcionamento pleno desse arquivo, a Segurança de Macros do Excel deve ser habilitada."]
[]
["2.1  Na Versão Excel 2003, selecione na Faixa de Opções: Ferramentas --> Macro --> Segurança --> Na aba Nível de Segurança selecione a Opção \"Baixo\" --> Clique em OK --> Feche e abra o Excel novamente para utilizar a Planilha."]
[]
["2.2 Na Versão Excel 2007 ou superior, selecione na Faixa de Opções: Arquivo --> Opções --> Central de Confiabilidade --> Configurações da Central de Confiabilidade --> Configurações de Macro --> Habilitar todas as Macros --> Clique em OK --> Feche e abra o excel novamente para utilizar a Planilha."]
[]
["3. O Preenchimento deve ser feito somente nas células em amarelo. As outras células são de preenchimento Automático."]
[]
["4. Preferências de Elaboração do Orçamento"]
[]
["4.1. Preenchimento de Quantidades"]
[]
[]
[]
["5. Ordem de Preenchimento"]
[]
["5.1. na Aba DADOS"]
[]
["5.1.1. Preencha no Quadro abaixo os Dados do TC/CR:"]
[]
["Nº OPERAÇÃO",null,"GESTOR",null,null,"PROGRAMA",null,null,null,"AÇÃO / MODALIDADE",null,null,null,null,null,"OBJETO"]
["1.037.474-20/2017",null,"Ministerio das Cidades",null,null,"Planejamento Urbano",null,null,null,"Contrato de repasse",null,null,null,null,null,"Implantação de pavimentação asfaltica em vias urbanas do Município de Bom Jesus SC."]
[]
["PROPONENTE / TOMADOR",null,null,null,null,null,"MUNICÍPIO / UF",null,null,null,"LOCALIDADE / ENDEREÇO",null,null,null,null,null,"APELIDO DO EMPREENDIMENTO"]
["Município de Bom Jesus",null,null,null,null,null,"Bom Jesus / SC",null,null,null,"Rua Domingos Michelin"]
[]
[]
["5.1.2. Preencha no quadro abaixo as informações sobre o orçamento:"]
[]
["DATA BASE",null,"DESON.","LOCALIDADE DO SINAPI",null,null,"DESCRIÇÃO DO LOTE",null,null,null,null,null,null,null,null,null,null,null,null,"BDI 1","BDI 2","BDI 3","BDI 4","BDI 5"]
["2017-08-01",null,"Não","Florianópolis / SC",null,null,"Lote 01",null,null,null,null,null,null,null,null,null,null,null,null,{"$f":"IF(ISERROR(INDIRECT(\"'BDI (\"&RIGHT(T37,1)&\")'!N27\")),\"\",INDIRECT(\"'BDI (\"&RIGHT(T37,1)&\")'!N27\"))","v":0.22},{"$f":"IF(ISERROR(INDIRECT(\"'BDI (\"&RIGHT(U37,1)&\")'!N27\")),\"\",INDIRECT(\"'BDI (\"&RIGHT(U37,1)&\")'!N27\"))","v":""},{"$f":"IF(ISERROR(INDIRECT(\"'BDI (\"&RIGHT(V37,1)&\")'!N27\")),\"\",INDIRECT(\"'BDI (\"&RIGHT(V37,1)&\")'!N27\"))","v":""},{"$f":"IF(ISERROR(INDIRECT(\"'BDI (\"&RIGHT(W37,1)&\")'!N27\")),\"\",INDIRECT(\"'BDI (\"&RIGHT(W37,1)&\")'!N27\"))","v":""},{"$f":"IF(ISERROR(INDIRECT(\"'BDI (\"&RIGHT(X37,1)&\")'!N27\")),\"\",INDIRECT(\"'BDI (\"&RIGHT(X37,1)&\")'!N27\"))","v":""}]
[]
["4.1.2. Preencha no quadro abaixo as informações sobre o orçamento licitado:"]
[]
["CTEF n.º",null,"NOME DA EMPRESA ",null,null,null,null,"DATA BASE",null,"DESON.","REGIME DE EXECUÇÃO",null,null,"ACOMP.","OBJETO CTEF",null,null,null,null,null,"DATA ASSINATURA",null,"VIGÊNCIA"]
[]
[]
["5.1.3. Preencha a data de Início da Obra:"]
[]
["DATA INÍCIO"]
["2017-12-01"]
[]
["5.1.4. Preencha no(s) Quadro(s) abaixo os Dados do(s) Responsável(is) Técnico(s) pela elaboração do Orçamento:"]
[]
[null,null,null,null,null,null,"Exibir o 2° Quadro de Assinatura?",null,null,null,"NÃO"]
[]
["Nome:","Alexandre Bée Longhi",null,null,null,null,"Nome:"]
[{"$f":"IF(OR(TipoOrçamento=\"BASE\",TipoOrçamento=\"REPROGRAMADONPL\"),\"Título:\",\"Cargo:\")","v":"Título:"},"Engenheiro Civil",null,null,null,null,{"$f":"A55","v":"Título:"}]
[{"$f":"IF(OR(TipoOrçamento=\"BASE\",TipoOrçamento=\"REPROGRAMADONPL\"),\"CREA/CAU:\",\"Empresa:\")","v":"CREA/CAU:"},"098.740-6",null,null,null,null,{"$f":"A56","v":"CREA/CAU:"}]
[{"$f":"IF(OR(TipoOrçamento=\"BASE\",TipoOrçamento=\"REPROGRAMADONPL\"),\"ART/RRT:\",\"CNPJ:\")","v":"ART/RRT:"},"6328923-5",null,null,null,null,{"$f":"A57","v":"ART/RRT:"}]
[]
[]
["5.2. Legenda das Abas"]
[]
["5.2.1.  LARANJA: Aba DADOS. Preenchimento Obrigatório. Impressão Dispensada."]
["5.2.2.  AMARELO: Abas BDI, PO, PLQ e CFF. Preenchimento e Impressão Obrigatórias. O preenchimento da Aba BDI é dispensada para os casos de Aquisição Direta de Materiais e Equipamentos. A Impressão da Aba PLQ pode ser dispensada para casos de Frente de Obra Única."]
[]
["5.3. na Aba BDI (Bonificações e Despesas Indiretas):"]
[]
["5.3.1. Escolha o tipo de empreendimento."]
["5.3.2. Escolha se o BDI será do tipo desonerado ou não (aba DADOS)"]
["5.3.3. Informe a base de cálculo do ISS (0 a 100%)."]
["5.3.4. Informe a alíquota do ISS (Normalmente de 2 a 5%)."]
["5.3.5. Defina na tabela os percentuais a serem adotados para cada item que compõe o BDI nos campos em amarelo."]
["5.3.6. Preencha o campo observações se necessário (recomendado para os orçamentos que utilizam mais de um BDI)."]
[]
["5.4. na Aba PO (Planilha Orçamentária):"]
[]
["5.4.1. Primeiramente, selecione os níveis de cada item do orçamento na coluna NÍVEL."]
["5.4.1.1: O nível de \"Serviço\" serve tanto para serviços ou insumos (mão-de-obra / material / equipamento / veículo / máquina / ferramenta / etc). Um \"nível 2/3/4\" é um título (é preenchida apenas a coluna descrição) utilizado para organizar melhor a planilha orçamentária e engloba (agrupa) serviços e agrupadores de nível inferior."]
["5.4.2. Após a seleção dos níveis, preencha, para cada serviço, as informações sobre a Fonte de Referência, (SINAPI, SICRO, SIURB, etc) e o respectivo Código de Referência."]
["5.4.3. Esta planilha é compatível com o arquivo REFERÊNCIA distribuído pela CAIXA. Caso o arquivo REFERÊNCIA esteja aberto, será possível buscar um código através do botão \"Buscar Código\". Desta forma a descrição dos serviços será preenchida automaticamente (podendo ser substituída). Caso contrário, seu preenchimento deve ser manual."]
["5.4.3.1. As descrições e unidades preenchidas automaticamente ficarão vinculadas ao arquivo REFERÊNCIA até que se use o botão \"Fixar Descrições\", que quebra a fórmula e transforma as descrições em texto."]
["5.4.4. Preencher o custo unitário do serviço/insumo na Coluna CUSTO UNITÁRIO. ATENÇÃO: o custo unitário adotado deve ser menor ou igual ao contido na tabela de referência ou mediana das cotações de mercado."]
["5.4.5. Indicar o BDI adotado para cada serviço/insumo na Coluna BDI. Preferencialmente selecione uma das opções da lista suspensa que aparecerá na célula, esta lista contém os 05 BDIs que podem ser preenchidos na Aba BDI (conforme item 5.2 das instruções). Caso seja necessária a adoção de mais de 05 valores diferentes de BDI, digite o percentual diretamente na célula."]
["5.4.6. Conforme selecionado no item 4.1. desta Aba, a Coluna Quantidade pode ser preenchida diretamente na PO, ou representar a soma das quantidades de cada Frente de Obra, informadas na aba PLQ (Planilha de Levantamento de Quantitativos)."]
["5.4.7. OBSERVAÇÃO: As demais colunas (Item / Quantidade / Preço Unitário / Preço Total) são de preenchimento automático. Não tente preenche-las ou alterá-las na Aba PO."]
["5.4.8. Se for necessário acrescentar ou excluir linhas da Planilha Orçamentária, utilize o Botão EDITAR PLANILHA e selecione as opções no quadro.\nATENÇÃO: quanto maior o número de linhas mais lento será o processamento dos dados, então acrescente apenas o número necessário ou um pouco a mais."]
["5.4.8.1. Evite deixar linhas em branco no corpo da Planilha Orçamentária."]
["5.4.9. Caso deseje importar os dados de outro arquivo utilize apenas a opção COLAR ESPECIAL ==> VALORES."]
["5.4.10. Clique no Botão LICITAR / REPROGRAMAR para preencher o Orçamento Licitado ou Reprogramado."]
[]
["5.5. na Aba PLQ (Planilha de Levantamento de Quantitativos):"]
[]
["5.5.1. Preencha primeiramente as Frentes de Obra."]
["5.5.1.1. Exemplos de Frentes de Obra (Rua A trecho 01 / Rua A trecho 02 / Rua B ; UH 01 / UH 02 / UH 03). "]
["5.5.2. Preencha as quantidades dos serviços por frente de obra. A soma das quantidades de todas as frentes de um determinado serviço será a quantidade exibida na Planilha Orçamentária."]
["5.5.3. Caso deseje incluir ou excluir frentes, utilize os botões ADICIONAR e EXCLUIR."]
[]
["5.6. na Aba CFF (Cronograma Físico-Financeiro):"]
[]
["5.6.1. Preencha a data de início da obra na aba Dados."]
["5.6.2. Preencha as porcentagens previstas por parcela para cada meta ou macrosserviço."]
["5.6.3. Para atualizar o Cronograma conforme o Orçamento e incluir ou excluir parcelas, utilize o botão EDITAR / ATUALIZAR CRONOGRAMA."]
[]
[]
[]
[]
[]
[null,null,null,null,null,null,null,null,null,null,null,"(Selecione uma Localidade)"]
[null,null,null,null,null,null,null,null,null,null,null,"Aracaju / SE",null,null,null,null,null,null,{"$f":"T38","v":0.22}]
[null,null,null,null,null,null,null,null,null,null,null,"Belém / PA",null,null,null,null,null,null,{"$f":"U38","v":""}]
[null,null,null,null,null,null,null,null,null,null,null,"Belo Horizonte / MG",null,null,null,null,null,null,{"$f":"V38","v":""}]
[null,null,null,null,null,null,null,null,null,null,null,"Boa Vista / RR",null,null,null,null,null,null,{"$f":"W38","v":""}]
[null,null,null,null,null,null,null,null,null,null,null,"Brasília / DF",null,null,null,null,null,null,{"$f":"X38","v":""}]
[null,null,null,null,null,null,null,null,null,null,null,"Campo Grande / MS"]
[null,null,null,null,null,null,null,null,null,null,null,"Cuiabá / MT"]
[null,null,null,null,null,null,null,null,null,null,null,"Curitiba / PR",null,null,null,"Empreitada Preço Global"]
[null,null,null,null,null,null,null,null,null,null,null,"Florianópolis / SC",null,null,null,"Empreitada Preço Unitário"]
[null,null,null,null,null,null,null,null,null,null,null,"Fortaleza / CE",null,null,null,"Empreitada Integral"]
[null,null,null,null,null,null,null,null,null,null,null,"Goiânia / GO",null,null,null,"Tarefa"]
[null,null,null,null,null,null,null,null,null,null,null,"João Pessoa / PB",null,null,null,"Contratação Integrada"]
[null,null,null,null,null,null,null,null,null,null,null,"Macapá / AP",null,null,null,"Não se aplica"]
[null,null,null,null,null,null,null,null,null,null,null,"Maceió / AL"]
[null,null,null,null,null,null,null,null,null,null,null,"Manaus / AM",null,null,null,"BM"]
[null,null,null,null,null,null,null,null,null,null,null,"Natal / RN",null,null,null,"PLE"]
[null,null,null,null,null,null,null,null,null,null,null,"Palmas / TO"]
[null,null,null,null,null,null,null,null,null,null,null,"Porto Alegre / RS"]
[null,null,null,null,null,null,null,null,null,null,null,"Porto Velho / RO"]
[null,null,null,null,null,null,null,null,null,null,null,"Recife / PE"]
[null,null,null,null,null,null,null,null,null,null,null,"Rio Branco / AC"]
[null,null,null,null,null,null,null,null,null,null,null,"Rio de Janeiro / RJ"]
[null,null,null,null,null,null,null,null,null,null,null,"Salvador / BA"]
[null,null,null,null,null,null,null,null,null,null,null,"São Luís / MA"]
[null,null,null,null,null,null,null,null,null,null,null,"São Paulo / SP"]
[null,null,null,null,null,null,null,null,null,null,null,"Teresina / PI"]
[null,null,null,null,null,null,null,null,null,null,null,"Vitória / ES"]
[]
[]
[]
[]
[]
[]
[]
[]
[]
[]
[]
[]
[]
[]
[]
[]
[]
[]
[]
[]
[]
[]
[]
[]
[]
[]
[]
[]
[]
[]
[]
[]
[]
[]
[]
[]
[]
[]
[]
[]
[]
[]
[]
[]
[]
[]
[]
[]
[]
[]
[]
[]
[]
[]
[]
[]
[]
[]
[]
[]
[]
[]
[]
[]
[]
[]
[]
[]
[]
[]
[]
[]
[]
[]
[]
[]
[]
[]
[]
[]
[]
[]
[]
[]
[]
[{"$f":"A28","v":"Nº OPERAÇÃO"},null,{"$f":"C28","v":"GESTOR"},null,null,{"$f":"F28","v":"PROGRAMA"},null,null,null,{"$f":"J28","v":"AÇÃO / MODALIDADE"},null,null,null,null,null,{"$f":"P28","v":"OBJETO"}]
[{"$f":"IF(A29=\"\",\"\",A29)","v":"1.037.474-20/2017"},null,{"$f":"IF(C29=\"\",\"\",C29)","v":"Ministerio das Cidades"},null,null,{"$f":"IF(F29=\"\",\"\",F29)","v":"Planejamento Urbano"},null,null,null,{"$f":"IF(J29=\"\",\"\",J29)","v":"Contrato de repasse"},null,{"$f":"IF(#REF!=\"\",\"\",#REF!)","v":{"$error":"#REF!"}},null,{"$f":"IF(#REF!=\"\",\"\",#REF!)","v":{"$error":"#REF!"}},null,{"$f":"IF(P29=\"\",\"\",P29)","v":"Implantação de pavimentação asfaltica em vias urbanas do Município de Bom Jesus SC."}]
[]
[{"$f":"A31","v":"PROPONENTE / TOMADOR"},null,null,null,null,null,{"$f":"G31","v":"MUNICÍPIO / UF"},null,null,null,{"$f":"K31","v":"LOCALIDADE / ENDEREÇO"},null,null,null,null,null,{"$f":"Q31","v":"APELIDO DO EMPREENDIMENTO"}]
[{"$f":"IF(A32=\"\",\"\",A32)","v":"Município de Bom Jesus"},null,null,null,null,null,{"$f":"IF(G32=\"\",\"\",G32)","v":"Bom Jesus / SC"},{"$f":"IF(I32=\"\",\"\",I32)","v":""},null,{"$f":"IF(#REF!=\"\",\"\",#REF!)","v":{"$error":"#REF!"}},{"$f":"IF(K32=\"\",\"\",K32)","v":"Rua Domingos Michelin"},null,null,null,null,null,{"$f":"IF(Q32=\"\",\"\",Q32)","v":""}]
[]
[{"$f":"A37","v":"DATA BASE"},null,{"$f":"C37","v":"DESON."},{"$f":"D37","v":"LOCALIDADE DO SINAPI"},null,null,{"$f":"G37","v":"DESCRIÇÃO DO LOTE"},null,null,null,null,null,null,null,null,null,null,null,null,{"$f":"T37","v":"BDI 1"},{"$f":"U37","v":"BDI 2"},{"$f":"V37","v":"BDI 3"},{"$f":"W37","v":"BDI 4"},{"$f":"X37","v":"BDI 5"}]
[{"$f":"IF(A38=\"\",\"\",A38)","v":"2017-08-01"},null,{"$f":"IF(C38=\"\",\"\",C38)","v":"Não"},"Florianópolis / SC","","","Lote 01","","","","","","","","","","","","",0.22,"","","",""]
[]
["CTEF n.º",null,"NOME DA EMPRESA / CNPJ:",null,null,null,null,"DATA BASE",null,"DESON.","REGIME DE EXECUÇÃO",null,null,"ACOMP.","OBJETO CTEF",null,null,null,null,null,"DATA ASSINATURA",null,"VIGÊNCIA"]
[{"$f":"IF(A43=\"\",\"\",A43)","v":""},null,{"$f":"IF(C43=\"\",\"\",C43)","v":""},null,{"$f":"IF(E43=\"\",\"\",E43)","v":""},null,{"$f":"IF(G43=\"\",\"\",G43)","v":""},{"$f":"IF(H43=\"\",\"\",H43)","v":""},{"$f":"IF(I43=\"\",\"\",I43)","v":""},{"$f":"IF(J43=\"\",\"\",J43)","v":""},{"$f":"IF(K43=\"\",\"\",K43)","v":""},null,{"$f":"IF(M43=\"\",\"\",M43)","v":""},{"$f":"IF(N43=\"\",\"\",N43)","v":""},{"$f":"IF(O43=\"\",\"\",O43)","v":""},null,{"$f":"IF(Q43=\"\",\"\",Q43)","v":""},null,{"$f":"IF(S43=\"\",\"\",S43)","v":""},null,{"$f":"IF(U43=\"\",\"\",U43)","v":""},null,{"$f":"IF(W43=\"\",\"\",W43)","v":""}]

{"sheet":"BDI (1)","index":1,"n_rows":59,"n_cols":23,"rows_kept":59,"cut":false,"hidden":false,"merged":[[49,9,49,11],[28,9,28,17],[25,8,25,11],[26,8,26,11],[26,15,26,17],[44,14,44,17],[30,8,30,17],[34,8,34,17],[41,14,41,17],[48,9,48,11],[39,8,39,17],[45,8,45,11],[45,14,45,17],[46,9,46,11],[46,15,46,17],[47,9,47,11],[15,19,23,20],[41,8,41,11],[17,8,17,11],[18,8,18,11],[19,8,19,11],[20,8,20,11],[21,8,21,11],[22,8,22,11],[23,8,23,11],[24,8,24,11],[15,17,16,17],[36,8,36,17],[31,15,32,15],[31,12,31,14],[32,12,32,14],[31,11,32,11],[10,8,10,15],[10,16,10,17],[3,8,3,9],[3,10,3,17],[4,8,4,9],[4,10,4,17],[6,8,6,17],[7,8,7,17],[9,8,9,15],[9,16,9,17],[47,15,47,17],[44,8,44,11],[42,8,42,11],[12,16,12,17],[13,8,13,15],[13,16,13,17],[15,12,16,12],[12,8,12,15],[15,15,16,15],[15,16,16,16],[15,13,16,13],[15,8,16,11],[15,14,16,14]]}
[null,null,null,null,"MIN","MED","MAX",null,null,null,null,null,null,{"$f":"\"Quadro de Composição do BDI \"&MID(CELL(\"nome.arquivo\",N1),5+FIND(\"BDI (\",CELL(\"nome.arquivo\",N1)),1)","v":"Quadro de Composição do BDI 1"}]
["Construção e Reforma de Edifícios","AC",{"$f":"CONCATENATE(A2,\"-\",B2)","v":"Construção e Reforma de Edifícios-AC"},null,0.03,0.04,5.5E-2]
[{"$f":"A2","v":"Construção e Reforma de Edifícios"},"SG","Construção e Reforma de Edifícios-SG",null,8.0000000000000002E-3,8.0000000000000002E-3,0.01]
[{"$f":"A3","v":"Construção e Reforma de Edifícios"},"R","Construção e Reforma de Edifícios-R",null,9.7000000000000003E-3,1.2699999999999999E-2,1.2699999999999999E-2,null,"Nº TC/CR",null,"PROPONENTE / TOMADOR"]
[{"$f":"A4","v":"Construção e Reforma de Edifícios"},"DF","Construção e Reforma de Edifícios-DF",null,5.8999999999999999E-3,1.23E-2,1.3899999999999999E-2,null,{"$f":"DADOS!A29","v":"1.037.474-20/2017"},null,{"$f":"DADOS!A32","v":"Município de Bom Jesus"}]
[{"$f":"A5","v":"Construção e Reforma de Edifícios"},"L","Construção e Reforma de Edifícios-L",null,6.1600000000000002E-2,7.400000000000001E-2,8.9600000000000013E-2]
[{"$f":"A6","v":"Construção e Reforma de Edifícios"},"BDI PAD","Construção e Reforma de Edifícios-BDI PAD",null,0.2034,0.22120000000000001,0.25,null,"OBJETO"]
["Construção de Praças Urbanas, Rodovias, Ferrovias e recapeamento e pavimentação de vias urbanas","AC","Construção de Praças Urbanas, Rodovias, Ferrovias e recapeamento e pavimentação de vias urbanas-AC",null,3.7999999999999999E-2,4.0099999999999997E-2,4.6699999999999998E-2,null,{"$f":"DADOS!P29","v":"Implantação de pavimentação asfaltica em vias urbanas do Município de Bom Jesus SC."}]
["Construção de Praças Urbanas, Rodovias, Ferrovias e recapeamento e pavimentação de vias urbanas","SG","Construção de Praças Urbanas, Rodovias, Ferrovias e recapeamento e pavimentação de vias urbanas-SG",null,3.2000000000000002E-3,4.0000000000000001E-3,7.4000000000000003E-3]
["Construção de Praças Urbanas, Rodovias, Ferrovias e recapeamento e pavimentação de vias urbanas","R","Construção de Praças Urbanas, Rodovias, Ferrovias e recapeamento e pavimentação de vias urbanas-R",null,5.0000000000000001E-3,5.6000000000000008E-3,9.7000000000000003E-3,null,"TIPO DE OBRA DO EMPREENDIMENTO",null,null,null,null,null,null,null,"DESONERAÇÃO"]
["Construção de Praças Urbanas, Rodovias, Ferrovias e recapeamento e pavimentação de vias urbanas","DF","Construção de Praças Urbanas, Rodovias, Ferrovias e recapeamento e pavimentação de vias urbanas-DF",null,1.0200000000000001E-2,1.11E-2,1.21E-2,null,"Construção de Praças Urbanas, Rodovias, Ferrovias e recapeamento e pavimentação de vias urbanas",null,null,null,null,null,null,null,{"$f":"DADOS!$C$38","v":"Não"}]
["Construção de Praças Urbanas, Rodovias, Ferrovias e recapeamento e pavimentação de vias urbanas","L","Construção de Praças Urbanas, Rodovias, Ferrovias e recapeamento e pavimentação de vias urbanas-L",null,6.6400000000000001E-2,7.2999999999999995E-2,8.6899999999999991E-2]
["Construção de Praças Urbanas, Rodovias, Ferrovias e recapeamento e pavimentação de vias urbanas","BDI PAD","Construção de Praças Urbanas, Rodovias, Ferrovias e recapeamento e pavimentação de vias urbanas-BDI PAD",null,0.19600000000000001,0.2097,0.24230000000000002,null,"Conforme legislação tributária municipal, definir estimativa de percentual da base de cálculo para o ISS:",null,null,null,null,null,null,null,1]
["Construção de Redes de Abastecimento de Água, Coleta de Esgoto","AC","Construção de Redes de Abastecimento de Água, Coleta de Esgoto-AC",null,3.4300000000000004E-2,4.9299999999999997E-2,6.7099999999999993E-2,null,"Sobre a base de cálculo, definir a respectiva alíquota do ISS (entre 2% e 5%):",null,null,null,null,null,null,null,0.03]
[{"$f":"A14","v":"Construção de Redes de Abastecimento de Água, Coleta de Esgoto"},"SG","Construção de Redes de Abastecimento de Água, Coleta de Esgoto-SG",null,2.8000000000000004E-3,4.8999999999999998E-3,7.4999999999999997E-3]
[null,null,null,null,null,null,null,null,"Itens",null,null,null,"Siglas","% Adotado","Situação","1º Quartil","Médio","3º Quartil",null,{"$f":"IF(V27,\"Para BDI fora do intervalo estatístico, deve ser apresentado Relatório Técnico Circunstanciado justificando a adoção do percentual de cada parcela do BDI.\",\"\")","v":""}]
[{"$f":"A15","v":"Construção de Redes de Abastecimento de Água, Coleta de Esgoto"},"R","Construção de Redes de Abastecimento de Água, Coleta de Esgoto-R",null,0.01,1.3899999999999999E-2,1.7399999999999999E-2]
[{"$f":"A17","v":"Construção de Redes de Abastecimento de Água, Coleta de Esgoto"},"DF","Construção de Redes de Abastecimento de Água, Coleta de Esgoto-DF",null,9.3999999999999986E-3,9.8999999999999991E-3,1.1699999999999999E-2,null,{"$f":"IF($I$11=$A$59,\"Encargos Sociais incidentes sobre a mão de obra\",\"Administração Central\")","v":"Administração Central"},null,null,null,{"$f":"IF($I$11=$A$59,\"K1\",\"AC\")","v":"AC"},4.0099999999999997E-2,"-",{"$f":"VLOOKUP(CONCATENATE(I$11,\"-\",M18),$C$2:$G$49,3,FALSE)","v":3.7999999999999999E-2},{"$f":"VLOOKUP(CONCATENATE(I$11,\"-\",M18),$C$2:$G$49,4,FALSE)","v":4.0099999999999997E-2},{"$f":"VLOOKUP(CONCATENATE(I$11,\"-\",M18),$C$2:$G$49,5,FALSE)","v":4.6699999999999998E-2}]
[{"$f":"A18","v":"Construção de Redes de Abastecimento de Água, Coleta de Esgoto"},"L","Construção de Redes de Abastecimento de Água, Coleta de Esgoto-L",null,6.7400000000000002E-2,8.0399999999999985E-2,9.4E-2,null,{"$f":"IF($I$11=$A$59,\"Administração Central da empresa ou consultoria - overhead\",\"Seguro e Garantia\")","v":"Seguro e Garantia"},null,null,null,{"$f":"IF($I$11=$A$59,\"K2\",\"SG\")","v":"SG"},4.0000000000000001E-3,"-",{"$f":"VLOOKUP(CONCATENATE(I$11,\"-\",M19),$C$2:$G$49,3,FALSE)","v":3.2000000000000002E-3},{"$f":"VLOOKUP(CONCATENATE(I$11,\"-\",M19),$C$2:$G$49,4,FALSE)","v":4.0000000000000001E-3},{"$f":"VLOOKUP(CONCATENATE(I$11,\"-\",M19),$C$2:$G$49,5,FALSE)","v":7.4000000000000003E-3}]
[{"$f":"A19","v":"Construção de Redes de Abastecimento de Água, Coleta de Esgoto"},"BDI PAD","Construção de Redes de Abastecimento de Água, Coleta de Esgoto-BDI PAD",null,0.20760000000000001,0.24179999999999999,0.26440000000000002,null,{"$f":"IF($I$11=$A$59,\"\",\"Risco\")","v":"Risco"},null,null,null,{"$f":"IF($I$11=$A$59,\"\",\"R\")","v":"R"},5.5999999999999999E-3,"-",{"$f":"VLOOKUP(CONCATENATE(I$11,\"-\",M20),$C$2:$G$49,3,FALSE)","v":5.0000000000000001E-3},{"$f":"VLOOKUP(CONCATENATE(I$11,\"-\",M20),$C$2:$G$49,4,FALSE)","v":5.6000000000000008E-3},{"$f":"VLOOKUP(CONCATENATE(I$11,\"-\",M20),$C$2:$G$49,5,FALSE)","v":9.7000000000000003E-3}]
["Construção e Manutenção de Estações e Redes de Distribuição de Energia Elétrica","AC","Construção e Manutenção de Estações e Redes de Distribuição de Energia Elétrica-AC",null,5.2900000000000003E-2,5.9200000000000003E-2,7.9299999999999995E-2,null,{"$f":"IF($I$11=$A$59,\"\",\"Despesas Financeiras\")","v":"Despesas Financeiras"},null,null,null,{"$f":"IF($I$11=$A$59,\"\",\"DF\")","v":"DF"},1.11E-2,"-",{"$f":"VLOOKUP(CONCATENATE(I$11,\"-\",M21),$C$2:$G$49,3,FALSE)","v":1.0200000000000001E-2},{"$f":"VLOOKUP(CONCATENATE(I$11,\"-\",M21),$C$2:$G$49,4,FALSE)","v":1.11E-2},{"$f":"VLOOKUP(CONCATENATE(I$11,\"-\",M21),$C$2:$G$49,5,FALSE)","v":1.21E-2}]
[{"$f":"A21","v":"Construção e Manutenção de Estações e Redes de Distribuição de Energia Elétrica"},"SG","Construção e Manutenção de Estações e Redes de Distribuição de Energia Elétrica-SG",null,2.5000000000000001E-3,5.1000000000000004E-3,5.6000000000000008E-3,null,{"$f":"IF($I$11=$A$59,\"Margem bruta da empresa de consultoria\",\"Lucro\")","v":"Lucro"},null,null,null,{"$f":"IF($I$11=$A$59,\"K3\",\"L\")","v":"L"},7.2999999999999995E-2,"-",{"$f":"VLOOKUP(CONCATENATE(I$11,\"-\",M22),$C$2:$G$49,3,FALSE)","v":6.6400000000000001E-2},{"$f":"VLOOKUP(CONCATENATE(I$11,\"-\",M22),$C$2:$G$49,4,FALSE)","v":7.2999999999999995E-2},{"$f":"VLOOKUP(CONCATENATE(I$11,\"-\",M22),$C$2:$G$49,5,FALSE)","v":8.6899999999999991E-2}]
[{"$f":"A22","v":"Construção e Manutenção de Estações e Redes de Distribuição de Energia Elétrica"},"R","Construção e Manutenção de Estações e Redes de Distribuição de Energia Elétrica-R",null,0.01,1.4800000000000001E-2,1.9699999999999999E-2,null,"Tributos (impostos COFINS 3%, e  PIS 0,65%)",null,null,null,"CP",3.6499999999999998E-2,"-",3.6499999999999998E-2,3.6499999999999998E-2,3.6499999999999998E-2]
[{"$f":"A23","v":"Construção e Manutenção de Estações e Redes de Distribuição de Energia Elétrica"},"DF","Construção e Manutenção de Estações e Redes de Distribuição de Energia Elétrica-DF",null,1.01E-2,1.0700000000000001E-2,1.11E-2,null,"Tributos (ISS, variável de acordo com o município)",null,null,null,"ISS",{"$f":"IF($I$11<>$A$58,Q14*Q13,0)","v":0.03},"-",0,2.5000000000000001E-2,0.05]
[{"$f":"A24","v":"Construção e Manutenção de Estações e Redes de Distribuição de Energia Elétrica"},"L","Construção e Manutenção de Estações e Redes de Distribuição de Energia Elétrica-L",null,0.08,8.3100000000000007E-2,9.5100000000000004E-2,null,"Tributos (Contribuição Previdenciária sobre a Receita Bruta - 0% ou 4,5% - Desoneração)",null,null,null,"CPRB",{"$f":"IF(AND($I$11<>$A$58,Q11=\"Sim\"),4.5%,0%)","v":0},{"$f":"IF(AND(N25>=P25, N25<=R25), \"OK\", \"Não OK\")","v":"OK"},0,4.4999999999999998E-2,4.4999999999999998E-2]
[{"$f":"A25","v":"Construção e Manutenção de Estações e Redes de Distribuição de Energia Elétrica"},"BDI PAD","Construção e Manutenção de Estações e Redes de Distribuição de Energia Elétrica-BDI PAD",null,0.24,0.25840000000000002,0.27860000000000001,null,"BDI SEM desoneração\n(Fórmula Acórdão TCU)",null,null,null,"BDI PAD",{"$f":"IF($I$11=$A$58,0,ROUND((((1+N18+N19+N20)*(1+N21)*(1+N22)/(1-(N23+N24)))-1),4))","v":0.22},{"$f":"IF(OR($I$11=$A$59,$I$11=$A$58,AND(N26>=P26, N26<=R26)), \"OK\", \"FORA DO INTERVALO\")","v":"OK"},{"$f":"IF($I$11=$A$58,0,VLOOKUP(CONCATENATE($I$11,\"-\",$M26),$C$2:$G$49,3,FALSE))","v":0.19600000000000001},{"$f":"IF($I$11=$A$58,0,VLOOKUP(CONCATENATE($I$11,\"-\",$M26),$C$2:$G$49,4,FALSE))","v":0.2097},{"$f":"IF($I$11=$A$58,0,VLOOKUP(CONCATENATE($I$11,\"-\",$M26),$C$2:$G$49,5,FALSE))","v":0.24230000000000002}]
["Obras Portuárias, Marítimas e Fluviais","AC","Obras Portuárias, Marítimas e Fluviais-AC",null,0.04,5.5199999999999999E-2,7.85E-2,null,"BDI COM desoneração",null,null,null,"BDI DES",{"$f":"IF($I$11=$A$58,0,ROUND((((1+N18+N19+N20)*(1+N21)*(1+N22)/(1-(N23+N24+N25)))-1),4))","v":0.22},{"$f":"IF(Q11<>\"Sim\",\"\",O26)","v":""},null,null,null,null,null,null,{"$f":"AND(COUNTA(N18:N23)=6,O26<>\"ok\",NOT(V29))","v":false},"pedir anexo"]
[{"$f":"A27","v":"Obras Portuárias, Marítimas e Fluviais"},"SG","Obras Portuárias, Marítimas e Fluviais-SG",null,8.1000000000000013E-3,1.2199999999999999E-2,1.9900000000000001E-2]
[{"$f":"A28","v":"Obras Portuárias, Marítimas e Fluviais"},"R","Obras Portuárias, Marítimas e Fluviais-R",null,1.46E-2,2.3199999999999998E-2,3.1600000000000003E-2,null,{"$f":"IF(V29,\"X\",\"\")","v":""},"Anexo: Relatório Técnico Circunstanciado justificando a adoção do percentual de cada parcela do BDI.",null,null,null,null,null,null,null,null,null,null,null,false,"anexo apresentado"]
[]
[null,null,null,null,null,null,null,null,"Os valores de BDI foram calculados com o emprego da fórmula:"]
[{"$f":"A29","v":"Obras Portuárias, Marítimas e Fluviais"},"DF","Obras Portuárias, Marítimas e Fluviais-DF",null,9.3999999999999986E-3,1.0200000000000001E-2,1.3300000000000001E-2,null,null,null,null,{"$f":"IF(Q11=\"Sim\",\"BDI.DES =\",\"BDI.PAD =\")","v":"BDI.PAD ="},{"$f":"IF($I$11=$A$59,\"(1+K1+K2)*(1+K3)\",\"(1+AC + S + R + G)*(1 + DF)*(1+L)\")","v":"(1+AC + S + R + G)*(1 + DF)*(1+L)"},null,null," - 1"]
[{"$f":"A32","v":"Obras Portuárias, Marítimas e Fluviais"},"L","Obras Portuárias, Marítimas e Fluviais-L",null,7.1399999999999991E-2,8.4000000000000005E-2,0.1043,null,null,null,null,null,{"$f":"IF(Q11=\"Sim\",\"(1-CP-ISS-CRPB)\",\"(1-CP-ISS)\")","v":"(1-CP-ISS)"}]
[{"$f":"A33","v":"Obras Portuárias, Marítimas e Fluviais"},"BDI PAD","Obras Portuárias, Marítimas e Fluviais-BDI PAD",null,0.22800000000000001,0.27479999999999999,0.3095]
[null,null,null,null,null,null,null,null,{"$f":"CONCATENATE(\"Declaro para os devidos fins que, conforme legislação tributária municipal, a base de cálculo para \",I11,\", é de \",Q13*100,\"%, com a respectiva alíquota de \",Q14*100,\"%.\")","v":"Declaro para os devidos fins que, conforme legislação tributária municipal, a base de cálculo para Construção de Praças Urbanas, Rodovias, Ferrovias e recapeamento e pavimentação de vias urbanas, é de 100%, com a respectiva alíquota de 3%."}]
[]
[null,null,null,null,null,null,null,null,{"$f":"CONCATENATE(\"Declaro para os devidos fins que o regime de Contribuição Previdenciária sobre a Receita Bruta adotado para elaboração do orçamento foi \",IF(Q11=\"Sim\",\"COM\",\"SEM\"),\" Desoneração, e que esta é a alternativa mais adequada para a Administração Pública.\")","v":"Declaro para os devidos fins que o regime de Contribuição Previdenciária sobre a Receita Bruta adotado para elaboração do orçamento foi SEM Desoneração, e que esta é a alternativa mais adequada para a Administração Pública."}]
["Fornecimento de Materiais e Equipamentos (aquisição indireta - em conjunto com licitação de obras)","AC","Fornecimento de Materiais e Equipamentos (aquisição indireta - em conjunto com licitação de obras)-AC",null,1.4999999999999999E-2,3.4500000000000003E-2,4.4900000000000002E-2]
[{"$f":"A38","v":"Fornecimento de Materiais e Equipamentos (aquisição indireta - em conjunto com licitação de obras)"},"SG","Fornecimento de Materiais e Equipamentos (aquisição indireta - em conjunto com licitação de obras)-SG",null,3.0000000000000001E-3,4.7999999999999996E-3,8.199999999999999E-3,null,"Observações:"]
[{"$f":"A39","v":"Fornecimento de Materiais e Equipamentos (aquisição indireta - em conjunto com licitação de obras)"},"R","Fornecimento de Materiais e Equipamentos (aquisição indireta - em conjunto com licitação de obras)-R",null,5.6000000000000008E-3,8.5000000000000006E-3,8.8999999999999999E-3]
[{"$f":"A40","v":"Fornecimento de Materiais e Equipamentos (aquisição indireta - em conjunto com licitação de obras)"},"DF","Fornecimento de Materiais e Equipamentos (aquisição indireta - em conjunto com licitação de obras)-DF",null,8.5000000000000006E-3,8.5000000000000006E-3,1.11E-2]
[{"$f":"A41","v":"Fornecimento de Materiais e Equipamentos (aquisição indireta - em conjunto com licitação de obras)"},"L","Fornecimento de Materiais e Equipamentos (aquisição indireta - em conjunto com licitação de obras)-L",null,3.5000000000000003E-2,5.1100000000000007E-2,6.2199999999999998E-2,null,{"$f":"PO!K70","v":"Bom Jesus / SC"},null,null,null,null,null,{"$f":"PO!K73","v":"2018-01-25"}]
[{"$f":"A42","v":"Fornecimento de Materiais e Equipamentos (aquisição indireta - em conjunto com licitação de obras)"},"BDI PAD","Fornecimento de Materiais e Equipamentos (aquisição indireta - em conjunto com licitação de obras)-BDI PAD",null,0.111,0.14019999999999999,0.16800000000000001,null,"Local",null,null,null,null,null,"Data"]
["Estudos e Projetos, Planos e Gerenciamento e outros correlatos","K1","Estudos e Projetos, Planos e Gerenciamento e outros correlatos-K1",null,"-","-","-"]
[{"$f":"A44","v":"Estudos e Projetos, Planos e Gerenciamento e outros correlatos"},"K2","Estudos e Projetos, Planos e Gerenciamento e outros correlatos-K2",null,"-",0.2,"-"]
[{"$f":"A45","v":"Estudos e Projetos, Planos e Gerenciamento e outros correlatos"},"","Estudos e Projetos, Planos e Gerenciamento e outros correlatos-",null,"-","-","-",null,"Responsável Técnico",null,null,null,null,null,"Responsável Tomador"]
[{"$f":"A46","v":"Estudos e Projetos, Planos e Gerenciamento e outros correlatos"},"","Estudos e Projetos, Planos e Gerenciamento e outros correlatos-",null,"-","-","-",null,"Nome:",{"$f":"DADOS!B54","v":"Alexandre Bée Longhi"},null,null,null,null,"Nome:","Rafael Calza"]
[{"$f":"A47","v":"Estudos e Projetos, Planos e Gerenciamento e outros correlatos"},"K3","Estudos e Projetos, Planos e Gerenciamento e outros correlatos-K3",null,"-",0.12,"-",null,"Título:",{"$f":"DADOS!B55","v":"Engenheiro Civil"},null,null,null,null,"Cargo:","Prefeito Municipal"]
[{"$f":"A48","v":"Estudos e Projetos, Planos e Gerenciamento e outros correlatos"},"BDI PAD","Estudos e Projetos, Planos e Gerenciamento e outros correlatos-BDI PAD",null,"-","-","-",null,{"$f":"DADOS!A56","v":"CREA/CAU:"},{"$f":"DADOS!B56","v":"098.740-6"}]
[null,null,null,null,null,null,null,null,{"$f":"DADOS!A57","v":"ART/RRT:"},{"$f":"DADOS!B57","v":"6328923-5"}]
[]
["Construção e Reforma de Edifícios"]
["Construção de Praças Urbanas, Rodovias, Ferrovias e recapeamento e pavimentação de vias urbanas"]
["Construção de Redes de Abastecimento de Água, Coleta de Esgoto"]
["Construção e Manutenção de Estações e Redes de Distribuição de Energia Elétrica"]
["Obras Portuárias, Marítimas e Fluviais"]
["Fornecimento de Materiais e Equipamentos (aquisição indireta - em conjunto com licitação de obras)"]
["Fornecimento de Materiais e Equipamentos (aquisição direta)"]
["Estudos e Projetos, Planos e Gerenciamento e outros correlatos"]

{"sheet":"PO","index":2,"n_rows":74,"n_cols":26,"rows_kept":74,"cut":false,"hidden":false,"merged":[[1,22,1,23],[66,10,66,19],[62,10,64,19],[59,12,59,19],[72,10,72,12],[69,10,69,12]]}
[null,null,null,null,null,null,null,null,null,null,null,null,null,"PO - PLANILHA ORÇAMENTÁRIA",null,null,null,null,null,"Grau de Sigilo"]
[null,"LOTE","Meta","Nível 2","Nível 3","Nível 4","Serviço",null,null,null,null,null,null,{"$f":"CHOOSE(1+LOG(1+2*(TipoOrçamento=\"BASE\")+4*(TipoOrçamento=\"LICITADO\")+8*(TipoOrçamento=\"REPROGRAMADOAC\")+16*(TipoOrçamento=\"REPROGRAMADONPL\"),2),\"nada\",\"Orçamento Base para Licitação\",\"Orçamento Licitado\",\"Orçamento Licitado Reprogramado\",\"Orçamento Base para Licitação - Reprogramado\")","v":"Orçamento Base para Licitação"},null,null,null,null,null,"#PUBLICO",null,null,"Arredondamento"]
[null,null,null,null,null,null,null,null,null,null,null,null,null,null,null,null,null,null,null,null,null,null,"Quantidade",true]
["Nmax",null,null,null,null,null,null,null,null,null,null,null,null,null,null,null,null,null,null,null,"ERRO GERAL",null,"Custo Unitáro",true]
[{"$f":"MAX($A$12:$A$59)","v":2},null,null,null,null,null,null,null,null,null,null,null,null,null,null,null,null,null,null,null,{"$f":"IF(COUNTIF($U$12:OFFSET($U$59,-1,0),\"DESCRIÇÃO\")+COUNTIF($U$12:OFFSET($U$59,-1,0),\"UNIDADE\")+COUNTIF($U$12:OFFSET($U$59,-1,0),\"SEM VALOR\")>0,\"NÃO OK\",\"OK\")","v":"OK"},"","BDI",true]
[null,null,null,null,null,null,null,null,null,null,null,null,null,null,null,null,null,null,null,null,null,null,"Preço Unitário",true]
[null,null,null,null,null,null,null,null,null,null,null,null,null,null,null,null,null,null,null,null,null,null,"Preço Total",true]
[]
[null,null,null,null,null,null,null,null,null,null,null,null,null,null,null,{"$f":"OFFSET(PLQ!$E$12,ROW($P9)-ROW(P$12),0)","v":"-"}]
["Nível","Altura","n1","n2","n3","n4","n5","Czero","Cnível","Nível","Item","Fonte","Código","Descrição","Unidade","Quantidade",{"$f":"IF(OR(TipoOrçamento=\"LICITADO\",TipoOrçamento=\"REPROGRAMADOAC\"),\"Preço Unitário (R$)\",\"Custo Unitário (R$)\")","v":"Custo Unitário (R$)"},"BDI\n(%)","Preço Unitário (R$)","Preço Total\n(R$)","Erro de Dados","Lista Crono","Concatenação Fonte-Código","BancoRef",{"$f":"IF(TipoOrçamento=\"LICITADO\",\"Preço Unitário Edital (R$)\",\"Custo Unitário Referência (R$)\")","v":"Custo Unitário Referência (R$)"},{"$f":"IF(TipoOrçamento=\"LICITADO\",\"Valor BDI Edital\",\"Valor BDI\")","v":"Valor BDI"}]
[{"$f":"CHOOSE(1+LOG(1+2*(J11=\"Meta\")+4*(J11=\"Nível 2\")+8*(J11=\"Nível 3\")+16*(J11=\"Nível 4\")+32*(J11=\"Serviço\"),2),0,1,2,3,4,\"S\")","v":"S"},{"$f":"IF(OR(A11=\"S\",A11=0),0,IF(ISERROR(I11),H11,SMALL(H11:I11,1)))","v":0},{"$f":"IF($A11=1,OFFSET(C11,-1,0)+1,OFFSET(C11,-1,0))","v":"n1"},{"$f":"IF($A11=1,0,IF($A11=2,OFFSET(D11,-1,0)+1,OFFSET(D11,-1,0)))","v":"n2"},{"$f":"IF(AND($A11<=2,$A11<>0),0,IF($A11=3,OFFSET(E11,-1,0)+1,OFFSET(E11,-1,0)))","v":"n3"},{"$f":"IF(AND($A11<=3,$A11<>0),0,IF($A11=4,OFFSET(F11,-1,0)+1,OFFSET(F11,-1,0)))","v":"n4"},{"$f":"IF(AND($A11<=4,$A11<>0),0,IF($A11=\"S\",OFFSET(G11,-1,0)+1,OFFSET(G11,-1,0)))","v":{"$error":"#VALUE!"}},{"$f":"IF(OR($A11=\"S\",$A11=0),0,MATCH(0,OFFSET($B11,1,$A11,ROW($A$59)-ROW($A11)),0))","v":0},{"$f":"IF(OR($A11=\"S\",$A11=0),0,MATCH(OFFSET($B11,0,$A11)+1,OFFSET($B11,1,$A11,ROW($A$59)-ROW($A11)),0))","v":0},"Serviço",{"$f":"IF($A11=0,\"-\",CONCATENATE(C11&\".\",IF(AND($A$5>=2,$A11>=2),D11&\".\",\"\"),IF(AND($A$5>=3,$A11>=3),E11&\".\",\"\"),IF(AND($A$5>=4,$A11>=4),F11&\".\",\"\"),IF($A11=\"S\",G11&\".\",\"\")))","v":{"$error":"#VALUE!"}},null,null,{"$f":"IF($A11=\"S\",Referencia.Descricao,\"(digite a descrição aqui)\")","v":""},{"$f":"Referencia.Unidade","v":""},{"$f":"OFFSET(PLQ!$E$12,ROW($P11)-ROW(P$12),0)","v":0},null,"BDI 1",{"$f":"IF($A11=\"S\",IF($Q$10=\"Preço Unitário (R$)\",PO.CustoUnitario,ROUND(PO.CustoUnitario*(1+$Z11),15-13*$X$6)),0)","v":0},{"$f":"IF($A11=\"S\",VTOTAL1,IF($A11=0,0,ROUND(SomaAgrup,15-13*$X$7)))","v":0},{"$f":"IF($J11=\"\",\"\",IF($N11=\"\",\"DESCRIÇÃO\",IF(AND($J11=\"Serviço\",$O11=\"\"),\"UNIDADE\",IF($T11<=0,\"SEM VALOR\",IF(AND($Y11<>\"\",$Q11>$Y11),\"ACIMA REF.\",\"\")))))","v":"DESCRIÇÃO"},{"$f":"IF(OR($A11=0,$A11=\"S\",$A11>CFF!$A$9),\"\",MAX(V$12:OFFSET(V11,-1,0))+1)","v":""},{"$f":"IF(AND($J11=\"Serviço\",$M11<>\"\"),IF($L11=\"\",$M11,CONCATENATE($L11,\"-\",$M11)))","v":false},{"$f":"IF(AND(Fonte<>\"\",Código<>\"\"),MATCH(Fonte&\" \"&IF(Fonte=\"sinapi\",SUBSTITUTE(SUBSTITUTE(Código,\"/00\",\"/\"),\"/0\",\"/\"),Código),INDIRECT(\"'[Referência \"&_xlnm.Database&\".xls]Banco'!$a:$a\"),0),\"X\")","v":"X"},{"$f":"IF(Import.Desoneracao=\"sim\",Referencia.Desonerado,Referencia.NaoDesonerado)","v":0},{"$f":"ROUND(IF(ISNUMBER(R11),R11,IF(LEFT(R11,3)=\"BDI\",HLOOKUP(R11,DADOS!$T$37:$X$38,2,FALSE),0)),15-11*$X$5)","v":0.22}]
[0,{"$f":"COUNTA(OFFSET(B12,1,0):B$59)","v":46},null,null,null,null,null,null,null,{"$f":"IF(OR(TipoOrçamento=\"LICITADO\",TipoOrçamento=\"REPROGRAMADOAC\"),\"CTEF\",\"LOTE\")","v":"LOTE"},0,null,null,{"$f":"IF(TipoOrçamento=\"LICITADO\",DADOS!O43,DADOS!G38)","v":"Lote 01"},null,null,null,null,null,{"$f":"SUMIF(OFFSET($J12,1,0,ROW(T59)-ROW(T12)-1),\"Serviço\",OFFSET(T12,1,0,ROW(T59)-ROW(T12)-1))","v":256995.36999999997},{"$f":"IF($N12=0,\"DESCRIÇÃO\",\"\")","v":""},0]
[{"$f":"CHOOSE(1+LOG(1+2*(J13=\"Meta\")+4*(J13=\"Nível 2\")+8*(J13=\"Nível 3\")+16*(J13=\"Nível 4\")+32*(J13=\"Serviço\"),2),0,1,2,3,4,\"S\")","v":1},{"$f":"IF(OR(A13=\"S\",A13=0),0,IF(ISERROR(I13),H13,SMALL(H13:I13,1)))","v":46},{"$f":"IF($A13=1,OFFSET(C13,-1,0)+1,OFFSET(C13,-1,0))","v":1},{"$f":"IF($A13=1,0,IF($A13=2,OFFSET(D13,-1,0)+1,OFFSET(D13,-1,0)))","v":0},{"$f":"IF(AND($A13<=2,$A13<>0),0,IF($A13=3,OFFSET(E13,-1,0)+1,OFFSET(E13,-1,0)))","v":0},{"$f":"IF(AND($A13<=3,$A13<>0),0,IF($A13=4,OFFSET(F13,-1,0)+1,OFFSET(F13,-1,0)))","v":0},{"$f":"IF(AND($A13<=4,$A13<>0),0,IF($A13=\"S\",OFFSET(G13,-1,0)+1,OFFSET(G13,-1,0)))","v":0},{"$f":"IF(OR($A13=\"S\",$A13=0),0,MATCH(0,OFFSET($B13,1,$A13,ROW($A$59)-ROW($A13)),0))","v":46},{"$f":"IF(OR($A13=\"S\",$A13=0),0,MATCH(OFFSET($B13,0,$A13)+1,OFFSET($B13,1,$A13,ROW($A$59)-ROW($A13)),0))","v":{"$error":"#N/A"}},"Meta",{"$f":"IF($A13=0,\"-\",CONCATENATE(C13&\".\",IF(AND($A$5>=2,$A13>=2),D13&\".\",\"\"),IF(AND($A$5>=3,$A13>=3),E13&\".\",\"\"),IF(AND($A$5>=4,$A13>=4),F13&\".\",\"\"),IF($A13=\"S\",G13&\".\",\"\")))","v":"1."},null,null,"PAVIMENTAÇÃO","",{"$f":"OFFSET(PLQ!$E$12,ROW($P13)-ROW(P$12),0)","v":0},null,"BDI 1",{"$f":"IF($A13=\"S\",IF($Q$10=\"Preço Unitário (R$)\",PO.CustoUnitario,ROUND(PO.CustoUnitario*(1+$Z13),15-13*$X$6)),0)","v":0},{"$f":"IF($A13=\"S\",VTOTAL1,IF($A13=0,0,ROUND(SomaAgrup,15-13*$X$7)))","v":256995.37},{"$f":"IF($J13=\"\",\"\",IF($N13=\"\",\"DESCRIÇÃO\",IF(AND($J13=\"Serviço\",$O13=\"\"),\"UNIDADE\",IF($T13<=0,\"SEM VALOR\",IF(AND($Y13<>\"\",$Q13>$Y13),\"ACIMA REF.\",\"\")))))","v":""},{"$f":"IF(OR($A13=0,$A13=\"S\",$A13>CFF!$A$9),\"\",MAX(V$12:OFFSET(V13,-1,0))+1)","v":1},{"$f":"IF(AND($J13=\"Serviço\",$M13<>\"\"),IF($L13=\"\",$M13,CONCATENATE($L13,\"-\",$M13)))","v":false},{"$f":"IF(AND(Fonte<>\"\",Código<>\"\"),MATCH(Fonte&\" \"&IF(Fonte=\"sinapi\",SUBSTITUTE(SUBSTITUTE(Código,\"/00\",\"/\"),\"/0\",\"/\"),Código),INDIRECT(\"'[Referência \"&_xlnm.Database&\".xls]Banco'!$a:$a\"),0),\"X\")","v":"X"},{"$f":"IF(Import.Desoneracao=\"sim\",Referencia.Desonerado,Referencia.NaoDesonerado)","v":0},{"$f":"ROUND(IF(ISNUMBER(R13),R13,IF(LEFT(R13,3)=\"BDI\",HLOOKUP(R13,DADOS!$T$37:$X$38,2,FALSE),0)),15-11*$X$5)","v":0.22}]
[2,5,1,1,0,0,0,45,5,"Nível 2","1.1.",null,null,"SERVIÇOS INICIAS","",{"$f":"OFFSET(PLQ!$E$12,ROW($P14)-ROW(P$12),0)","v":0},null,"BDI 1",0,8370.7800000000007,"",{"$f":"IF(OR($A14=0,$A14=\"S\",$A14>CFF!$A$9),\"\",MAX(V$12:OFFSET(V14,-1,0))+1)","v":2},false,"X",{"$f":"IF(Import.Desoneracao=\"sim\",Referencia.Desonerado,Referencia.NaoDesonerado)","v":0},{"$f":"ROUND(IF(ISNUMBER(R14),R14,IF(LEFT(R14,3)=\"BDI\",HLOOKUP(R14,DADOS!$T$37:$X$38,2,FALSE),0)),15-11*$X$5)","v":0.22}]
["S",0,1,1,0,0,1,0,0,"Serviço","1.1.1.","SINAPI","74209/1","Placa de obra em chapa de aço galvanizado 1,25 x 2,00 m","m²",{"$f":"OFFSET(PLQ!$E$12,ROW($P15)-ROW(P$12),0)","v":2.5},334.2,"BDI 1",407.72,1019.3,"",{"$f":"IF(OR($A15=0,$A15=\"S\",$A15>CFF!$A$9),\"\",MAX(V$12:OFFSET(V15,-1,0))+1)","v":""},"SINAPI-74209/1",5891,{"$f":"IF(Import.Desoneracao=\"sim\",Referencia.Desonerado,Referencia.NaoDesonerado)","v":334.21},{"$f":"ROUND(IF(ISNUMBER(R15),R15,IF(LEFT(R15,3)=\"BDI\",HLOOKUP(R15,DADOS!$T$37:$X$38,2,FALSE),0)),15-11*$X$5)","v":0.22}]
["S",0,1,1,0,0,2,0,0,"Serviço","1.1.2.","SINAPI","90778","Engenheiro Civil","h",{"$f":"OFFSET(PLQ!$E$12,ROW($P16)-ROW(P$12),0)","v":24},104.85,"BDI 1",127.92,3070.08,"",{"$f":"IF(OR($A16=0,$A16=\"S\",$A16>CFF!$A$9),\"\",MAX(V$12:OFFSET(V16,-1,0))+1)","v":""},"SINAPI-90778",109,{"$f":"IF(Import.Desoneracao=\"sim\",Referencia.Desonerado,Referencia.NaoDesonerado)","v":104.87},{"$f":"ROUND(IF(ISNUMBER(R16),R16,IF(LEFT(R16,3)=\"BDI\",HLOOKUP(R16,DADOS!$T$37:$X$38,2,FALSE),0)),15-11*$X$5)","v":0.22}]
["S",0,1,1,0,0,3,0,0,"Serviço","1.1.3.","SINAPI","90780","Mestre de obras","h",{"$f":"OFFSET(PLQ!$E$12,ROW($P17)-ROW(P$12),0)","v":40},83.15,"BDI 1",101.44,4057.6,"",{"$f":"IF(OR($A17=0,$A17=\"S\",$A17>CFF!$A$9),\"\",MAX(V$12:OFFSET(V17,-1,0))+1)","v":""},"SINAPI-90780",111,{"$f":"IF(Import.Desoneracao=\"sim\",Referencia.Desonerado,Referencia.NaoDesonerado)","v":83.19},{"$f":"ROUND(IF(ISNUMBER(R17),R17,IF(LEFT(R17,3)=\"BDI\",HLOOKUP(R17,DADOS!$T$37:$X$38,2,FALSE),0)),15-11*$X$5)","v":0.22}]
["S",0,1,1,0,0,4,0,0,"Serviço","1.1.4.","composição","005","Locação de obra de pavimentação asfaltica com equipe de topografia","h",{"$f":"OFFSET(PLQ!$E$12,ROW($P18)-ROW(P$12),0)","v":5},36.69,"BDI 1",44.76,223.8,"",{"$f":"IF(OR($A18=0,$A18=\"S\",$A18>CFF!$A$9),\"\",MAX(V$12:OFFSET(V18,-1,0))+1)","v":""},"composição-005",10,{"$f":"IF(Import.Desoneracao=\"sim\",Referencia.Desonerado,Referencia.NaoDesonerado)","v":36.69},{"$f":"ROUND(IF(ISNUMBER(R18),R18,IF(LEFT(R18,3)=\"BDI\",HLOOKUP(R18,DADOS!$T$37:$X$38,2,FALSE),0)),15-11*$X$5)","v":0.22}]
[2,3,1,2,0,0,0,40,3,"Nível 2","1.2.",null,null,"MOBILIZAÇÃO E DESMOBILIZAÇÃO","",{"$f":"OFFSET(PLQ!$E$12,ROW($P19)-ROW(P$12),0)","v":0},null,"BDI 1",0,3245.44,"",{"$f":"IF(OR($A19=0,$A19=\"S\",$A19>CFF!$A$9),\"\",MAX(V$12:OFFSET(V19,-1,0))+1)","v":3},false,"X",{"$f":"IF(Import.Desoneracao=\"sim\",Referencia.Desonerado,Referencia.NaoDesonerado)","v":0},{"$f":"ROUND(IF(ISNUMBER(R19),R19,IF(LEFT(R19,3)=\"BDI\",HLOOKUP(R19,DADOS!$T$37:$X$38,2,FALSE),0)),15-11*$X$5)","v":0.22}]
["S",0,1,2,0,0,1,0,0,"Serviço","1.2.1.","composição","001","Mobilização","unid.",{"$f":"OFFSET(PLQ!$E$12,ROW($P20)-ROW(P$12),0)","v":1},1330.1,"BDI 1",1622.72,1622.72,"",{"$f":"IF(OR($A20=0,$A20=\"S\",$A20>CFF!$A$9),\"\",MAX(V$12:OFFSET(V20,-1,0))+1)","v":""},"composição-001",7,{"$f":"IF(Import.Desoneracao=\"sim\",Referencia.Desonerado,Referencia.NaoDesonerado)","v":1330.1},{"$f":"ROUND(IF(ISNUMBER(R20),R20,IF(LEFT(R20,3)=\"BDI\",HLOOKUP(R20,DADOS!$T$37:$X$38,2,FALSE),0)),15-11*$X$5)","v":0.22}]
["S",0,1,2,0,0,2,0,0,"Serviço","1.2.2.","composição","002","Desmobilização","unid.",{"$f":"OFFSET(PLQ!$E$12,ROW($P21)-ROW(P$12),0)","v":1},1330.1,"BDI 1",1622.72,1622.72,"",{"$f":"IF(OR($A21=0,$A21=\"S\",$A21>CFF!$A$9),\"\",MAX(V$12:OFFSET(V21,-1,0))+1)","v":""},"composição-002",8,{"$f":"IF(Import.Desoneracao=\"sim\",Referencia.Desonerado,Referencia.NaoDesonerado)","v":1330.1},{"$f":"ROUND(IF(ISNUMBER(R21),R21,IF(LEFT(R21,3)=\"BDI\",HLOOKUP(R21,DADOS!$T$37:$X$38,2,FALSE),0)),15-11*$X$5)","v":0.22}]
[2,12,1,3,0,0,0,37,12,"Nível 2","1.3.",null,null,"DRENAGEM","",{"$f":"OFFSET(PLQ!$E$12,ROW($P22)-ROW(P$12),0)","v":0},null,"BDI 1",0,7666.48,"",{"$f":"IF(OR($A22=0,$A22=\"S\",$A22>CFF!$A$9),\"\",MAX(V$12:OFFSET(V22,-1,0))+1)","v":4},false,"X",{"$f":"IF(Import.Desoneracao=\"sim\",Referencia.Desonerado,Referencia.NaoDesonerado)","v":0},{"$f":"ROUND(IF(ISNUMBER(R22),R22,IF(LEFT(R22,3)=\"BDI\",HLOOKUP(R22,DADOS!$T$37:$X$38,2,FALSE),0)),15-11*$X$5)","v":0.22}]
["S",0,1,3,0,0,1,0,0,"Serviço","1.3.1.","SINAPI",92809,"Assentamentos de tubos BSTC Ø 400mm","m",{"$f":"OFFSET(PLQ!$E$12,ROW($P23)-ROW(P$12),0)","v":12},40.33,"BDI 1",49.2,590.4,"",{"$f":"IF(OR($A23=0,$A23=\"S\",$A23>CFF!$A$9),\"\",MAX(V$12:OFFSET(V23,-1,0))+1)","v":""},{"$f":"IF(AND($J23=\"Serviço\",$M23<>\"\"),IF($L23=\"\",$M23,CONCATENATE($L23,\"-\",$M23)))","v":"SINAPI-92809"},5789,{"$f":"IF(Import.Desoneracao=\"sim\",Referencia.Desonerado,Referencia.NaoDesonerado)","v":40.369999999999997},{"$f":"ROUND(IF(ISNUMBER(R23),R23,IF(LEFT(R23,3)=\"BDI\",HLOOKUP(R23,DADOS!$T$37:$X$38,2,FALSE),0)),15-11*$X$5)","v":0.22}]
["S",0,1,3,0,0,2,0,0,"Serviço","1.3.2.","SINAPI-I","7781","Tubo de concreto simples 400 mm Classe PS1","m",{"$f":"OFFSET(PLQ!$E$12,ROW($P24)-ROW(P$12),0)","v":12},26.39,"BDI 1",32.200000000000003,386.4,"",{"$f":"IF(OR($A24=0,$A24=\"S\",$A24>CFF!$A$9),\"\",MAX(V$12:OFFSET(V24,-1,0))+1)","v":""},"SINAPI-I-7781",5231,{"$f":"IF(Import.Desoneracao=\"sim\",Referencia.Desonerado,Referencia.NaoDesonerado)","v":26.44},{"$f":"ROUND(IF(ISNUMBER(R24),R24,IF(LEFT(R24,3)=\"BDI\",HLOOKUP(R24,DADOS!$T$37:$X$38,2,FALSE),0)),15-11*$X$5)","v":0.22}]
["S",0,1,3,0,0,3,0,0,"Serviço","1.3.3.","SINAPI",72840,"Transporte comercial com caminhão carroceria 9 T - DMT = 50 Km","Txkm",{"$f":"OFFSET(PLQ!$E$12,ROW($P25)-ROW(P$12),0)","v":71.7},0.54,"BDI 1",0.66,47.32,"",{"$f":"IF(OR($A25=0,$A25=\"S\",$A25>CFF!$A$9),\"\",MAX(V$12:OFFSET(V25,-1,0))+1)","v":""},"SINAPI-72840",10040,{"$f":"IF(Import.Desoneracao=\"sim\",Referencia.Desonerado,Referencia.NaoDesonerado)","v":0.54},{"$f":"ROUND(IF(ISNUMBER(R25),R25,IF(LEFT(R25,3)=\"BDI\",HLOOKUP(R25,DADOS!$T$37:$X$38,2,FALSE),0)),15-11*$X$5)","v":0.22}]
["S",0,1,3,0,0,4,0,0,"Serviço","1.3.4.","SINAPI",90106,"Escavação de valas p/ galerias tubulares","m³",{"$f":"OFFSET(PLQ!$E$12,ROW($P26)-ROW(P$12),0)","v":14.4},10.98,"BDI 1",13.4,192.96,"",{"$f":"IF(OR($A26=0,$A26=\"S\",$A26>CFF!$A$9),\"\",MAX(V$12:OFFSET(V26,-1,0))+1)","v":""},"SINAPI-90106",9983,{"$f":"IF(Import.Desoneracao=\"sim\",Referencia.Desonerado,Referencia.NaoDesonerado)","v":11.03},{"$f":"ROUND(IF(ISNUMBER(R26),R26,IF(LEFT(R26,3)=\"BDI\",HLOOKUP(R26,DADOS!$T$37:$X$38,2,FALSE),0)),15-11*$X$5)","v":0.22}]
["S",0,1,3,0,0,5,0,0,"Serviço","1.3.5.","SINAPI",93379,"Reaterro de valas p/ galerias tubulares","m³",{"$f":"OFFSET(PLQ!$E$12,ROW($P27)-ROW(P$12),0)","v":10},15.33,"BDI 1",18.7,187,"",{"$f":"IF(OR($A27=0,$A27=\"S\",$A27>CFF!$A$9),\"\",MAX(V$12:OFFSET(V27,-1,0))+1)","v":""},"SINAPI-93379",10034,{"$f":"IF(Import.Desoneracao=\"sim\",Referencia.Desonerado,Referencia.NaoDesonerado)","v":15.39},{"$f":"ROUND(IF(ISNUMBER(R27),R27,IF(LEFT(R27,3)=\"BDI\",HLOOKUP(R27,DADOS!$T$37:$X$38,2,FALSE),0)),15-11*$X$5)","v":0.22}]
["S",0,1,3,0,0,6,0,0,"Serviço","1.3.6.","SINAPI",73710,"Recomposição com base de brita graduada compacatada - esp 30 cm","m³",{"$f":"OFFSET(PLQ!$E$12,ROW($P28)-ROW(P$12),0)","v":2.9},95,"BDI 1",115.9,336.11,"",{"$f":"IF(OR($A28=0,$A28=\"S\",$A28>CFF!$A$9),\"\",MAX(V$12:OFFSET(V28,-1,0))+1)","v":""},"SINAPI-73710",10328,{"$f":"IF(Import.Desoneracao=\"sim\",Referencia.Desonerado,Referencia.NaoDesonerado)","v":100.13},{"$f":"ROUND(IF(ISNUMBER(R28),R28,IF(LEFT(R28,3)=\"BDI\",HLOOKUP(R28,DADOS!$T$37:$X$38,2,FALSE),0)),15-11*$X$5)","v":0.22}]
["S",0,1,3,0,0,7,0,0,"Serviço","1.3.7.","SINAPI",83356,"Transporte de brita graduada - DMT = 50 Km","m³xkm",{"$f":"OFFSET(PLQ!$E$12,ROW($P29)-ROW(P$12),0)","v":145},0.71,"BDI 1",0.87,126.15,"",{"$f":"IF(OR($A29=0,$A29=\"S\",$A29>CFF!$A$9),\"\",MAX(V$12:OFFSET(V29,-1,0))+1)","v":""},"SINAPI-83356",10070,{"$f":"IF(Import.Desoneracao=\"sim\",Referencia.Desonerado,Referencia.NaoDesonerado)","v":0.71},{"$f":"ROUND(IF(ISNUMBER(R29),R29,IF(LEFT(R29,3)=\"BDI\",HLOOKUP(R29,DADOS!$T$37:$X$38,2,FALSE),0)),15-11*$X$5)","v":0.22}]
["S",0,1,3,0,0,8,0,0,"Serviço","1.3.8.","SINAPI",72945,"Imprimação da Base com asfalto diluído CM 30 - taxa = 1,2 L/m²","m²",{"$f":"OFFSET(PLQ!$E$12,ROW($P30)-ROW(P$12),0)","v":9.6},4.0999999999999996,"BDI 1",5,48,"",{"$f":"IF(OR($A30=0,$A30=\"S\",$A30>CFF!$A$9),\"\",MAX(V$12:OFFSET(V30,-1,0))+1)","v":""},"SINAPI-72945",10335,{"$f":"IF(Import.Desoneracao=\"sim\",Referencia.Desonerado,Referencia.NaoDesonerado)","v":4.47},{"$f":"ROUND(IF(ISNUMBER(R30),R30,IF(LEFT(R30,3)=\"BDI\",HLOOKUP(R30,DADOS!$T$37:$X$38,2,FALSE),0)),15-11*$X$5)","v":0.22}]
["S",0,1,3,0,0,9,0,0,"Serviço","1.3.9.","SINAPI",93177,"Transporte de material betuminoso CM 30 - DMT = 50 Km","Txkm",{"$f":"OFFSET(PLQ!$E$12,ROW($P31)-ROW(P$12),0)","v":0.6},1.42,"BDI 1",1.73,1.04,"",{"$f":"IF(OR($A31=0,$A31=\"S\",$A31>CFF!$A$9),\"\",MAX(V$12:OFFSET(V31,-1,0))+1)","v":""},"SINAPI-93177",11398,{"$f":"IF(Import.Desoneracao=\"sim\",Referencia.Desonerado,Referencia.NaoDesonerado)","v":1.42},{"$f":"ROUND(IF(ISNUMBER(R31),R31,IF(LEFT(R31,3)=\"BDI\",HLOOKUP(R31,DADOS!$T$37:$X$38,2,FALSE),0)),15-11*$X$5)","v":0.22}]
["S",0,1,3,0,0,10,0,0,"Serviço","1.3.10.","composição","003","Caixa coletora tipo BL completa","unid.",{"$f":"OFFSET(PLQ!$E$12,ROW($P32)-ROW(P$12),0)","v":2},1198.3599999999999,"BDI 1",1462,2924,"",{"$f":"IF(OR($A32=0,$A32=\"S\",$A32>CFF!$A$9),\"\",MAX(V$12:OFFSET(V32,-1,0))+1)","v":""},{"$f":"IF(AND($J32=\"Serviço\",$M32<>\"\"),IF($L32=\"\",$M32,CONCATENATE($L32,\"-\",$M32)))","v":"composição-003"},9,{"$f":"IF(Import.Desoneracao=\"sim\",Referencia.Desonerado,Referencia.NaoDesonerado)","v":1199.9899999999998},{"$f":"ROUND(IF(ISNUMBER(R32),R32,IF(LEFT(R32,3)=\"BDI\",HLOOKUP(R32,DADOS!$T$37:$X$38,2,FALSE),0)),15-11*$X$5)","v":0.22}]
["S",0,1,3,0,0,11,0,0,"Serviço","1.3.11.","composição","006","Elevação de caixa coletora tipo boca de lobo, com reaproveitamento da grade de ferro","unid.",{"$f":"OFFSET(PLQ!$E$12,ROW($P33)-ROW(P$12),0)","v":17},136.31,"BDI 1",166.3,2827.1,"",{"$f":"IF(OR($A33=0,$A33=\"S\",$A33>CFF!$A$9),\"\",MAX(V$12:OFFSET(V33,-1,0))+1)","v":""},"composição-006",11,{"$f":"IF(Import.Desoneracao=\"sim\",Referencia.Desonerado,Referencia.NaoDesonerado)","v":136.48000000000002},{"$f":"ROUND(IF(ISNUMBER(R33),R33,IF(LEFT(R33,3)=\"BDI\",HLOOKUP(R33,DADOS!$T$37:$X$38,2,FALSE),0)),15-11*$X$5)","v":0.22}]
[2,19,1,4,0,0,0,25,19,"Nível 2","1.4.",null,null,"PAVIMENTAÇÃO","",{"$f":"OFFSET(PLQ!$E$12,ROW($P34)-ROW(P$12),0)","v":0},null,"BDI 1",0,229987.18,"",{"$f":"IF(OR($A34=0,$A34=\"S\",$A34>CFF!$A$9),\"\",MAX(V$12:OFFSET(V34,-1,0))+1)","v":5},false,"X",{"$f":"IF(Import.Desoneracao=\"sim\",Referencia.Desonerado,Referencia.NaoDesonerado)","v":0},{"$f":"ROUND(IF(ISNUMBER(R34),R34,IF(LEFT(R34,3)=\"BDI\",HLOOKUP(R34,DADOS!$T$37:$X$38,2,FALSE),0)),15-11*$X$5)","v":0.22}]
["S",0,1,4,0,0,1,0,0,"Serviço","1.4.1.","SINAPI","90106","Escavação mecanizada - e: 25 cm","m³",{"$f":"OFFSET(PLQ!$E$12,ROW($P35)-ROW(P$12),0)","v":8},10.98,"BDI 1",13.4,107.2,"",{"$f":"IF(OR($A35=0,$A35=\"S\",$A35>CFF!$A$9),\"\",MAX(V$12:OFFSET(V35,-1,0))+1)","v":""},"SINAPI-90106",9983,{"$f":"IF(Import.Desoneracao=\"sim\",Referencia.Desonerado,Referencia.NaoDesonerado)","v":11.03},{"$f":"ROUND(IF(ISNUMBER(R35),R35,IF(LEFT(R35,3)=\"BDI\",HLOOKUP(R35,DADOS!$T$37:$X$38,2,FALSE),0)),15-11*$X$5)","v":0.22}]
["S",0,1,4,0,0,2,0,0,"Serviço","1.4.2.","SINAPI",72961,"Regularização e compactação do sub-leito a 100% do PN","m²",{"$f":"OFFSET(PLQ!$E$12,ROW($P36)-ROW(P$12),0)","v":32},1.25,"BDI 1",1.53,48.96,"",{"$f":"IF(OR($A36=0,$A36=\"S\",$A36>CFF!$A$9),\"\",MAX(V$12:OFFSET(V36,-1,0))+1)","v":""},"SINAPI-72961",10327,{"$f":"IF(Import.Desoneracao=\"sim\",Referencia.Desonerado,Referencia.NaoDesonerado)","v":1.25},{"$f":"ROUND(IF(ISNUMBER(R36),R36,IF(LEFT(R36,3)=\"BDI\",HLOOKUP(R36,DADOS!$T$37:$X$38,2,FALSE),0)),15-11*$X$5)","v":0.22}]
["S",0,1,4,0,0,3,0,0,"Serviço","1.4.3.","SINAPI","73766/001","Sub base macadame hidraulico espessura = 15 cm","m³",{"$f":"OFFSET(PLQ!$E$12,ROW($P37)-ROW(P$12),0)","v":4.8},90,"BDI 1",109.8,527.04,"",{"$f":"IF(OR($A37=0,$A37=\"S\",$A37>CFF!$A$9),\"\",MAX(V$12:OFFSET(V37,-1,0))+1)","v":""},"SINAPI-73766/001",10330,{"$f":"IF(Import.Desoneracao=\"sim\",Referencia.Desonerado,Referencia.NaoDesonerado)","v":123.82},{"$f":"ROUND(IF(ISNUMBER(R37),R37,IF(LEFT(R37,3)=\"BDI\",HLOOKUP(R37,DADOS!$T$37:$X$38,2,FALSE),0)),15-11*$X$5)","v":0.22}]
["S",0,1,4,0,0,4,0,0,"Serviço","1.4.4.","SINAPI",73710,"Base de brita graduada compactada - esp= 10 cm","m³",{"$f":"OFFSET(PLQ!$E$12,ROW($P38)-ROW(P$12),0)","v":3.2},95,"BDI 1",115.9,370.88,"",{"$f":"IF(OR($A38=0,$A38=\"S\",$A38>CFF!$A$9),\"\",MAX(V$12:OFFSET(V38,-1,0))+1)","v":""},"SINAPI-73710",10328,{"$f":"IF(Import.Desoneracao=\"sim\",Referencia.Desonerado,Referencia.NaoDesonerado)","v":100.13},{"$f":"ROUND(IF(ISNUMBER(R38),R38,IF(LEFT(R38,3)=\"BDI\",HLOOKUP(R38,DADOS!$T$37:$X$38,2,FALSE),0)),15-11*$X$5)","v":0.22}]
["S",0,1,4,0,0,5,0,0,"Serviço","1.4.5.","SINAPI",83356,"Transporte de macadame hidraulico e brita graduada - DMT = 50 Km","m³xkm",{"$f":"OFFSET(PLQ!$E$12,ROW($P39)-ROW(P$12),0)","v":400},0.71,"BDI 1",0.87,348,"",{"$f":"IF(OR($A39=0,$A39=\"S\",$A39>CFF!$A$9),\"\",MAX(V$12:OFFSET(V39,-1,0))+1)","v":""},"SINAPI-83356",10070,{"$f":"IF(Import.Desoneracao=\"sim\",Referencia.Desonerado,Referencia.NaoDesonerado)","v":0.71},{"$f":"ROUND(IF(ISNUMBER(R39),R39,IF(LEFT(R39,3)=\"BDI\",HLOOKUP(R39,DADOS!$T$37:$X$38,2,FALSE),0)),15-11*$X$5)","v":0.22}]
["S",0,1,4,0,0,6,0,0,"Serviço","1.4.6.","SINAPI",72945,"Imprimação da Base com asfalto diluído CM 30 - taxa = 1,2 L/m²","m²",{"$f":"OFFSET(PLQ!$E$12,ROW($P40)-ROW(P$12),0)","v":32},4.0999999999999996,"BDI 1",5,160,"",{"$f":"IF(OR($A40=0,$A40=\"S\",$A40>CFF!$A$9),\"\",MAX(V$12:OFFSET(V40,-1,0))+1)","v":""},"SINAPI-72945",10335,{"$f":"IF(Import.Desoneracao=\"sim\",Referencia.Desonerado,Referencia.NaoDesonerado)","v":4.47},{"$f":"ROUND(IF(ISNUMBER(R40),R40,IF(LEFT(R40,3)=\"BDI\",HLOOKUP(R40,DADOS!$T$37:$X$38,2,FALSE),0)),15-11*$X$5)","v":0.22}]
[{"$f":"CHOOSE(1+LOG(1+2*(J41=\"Meta\")+4*(J41=\"Nível 2\")+8*(J41=\"Nível 3\")+16*(J41=\"Nível 4\")+32*(J41=\"Serviço\"),2),0,1,2,3,4,\"S\")","v":"S"},{"$f":"IF(OR(A41=\"S\",A41=0),0,IF(ISERROR(I41),H41,SMALL(H41:I41,1)))","v":0},1,4,0,0,7,0,0,"Serviço","1.4.7.","SINAPI",93177,"Transporte de material betuminoso CM 30 - DMT = 50 Km","Txkm",{"$f":"OFFSET(PLQ!$E$12,ROW($P41)-ROW(P$12),0)","v":1.9},1.42,"BDI 1",1.73,3.29,"",{"$f":"IF(OR($A41=0,$A41=\"S\",$A41>CFF!$A$9),\"\",MAX(V$12:OFFSET(V41,-1,0))+1)","v":""},"SINAPI-93177",11398,{"$f":"IF(Import.Desoneracao=\"sim\",Referencia.Desonerado,Referencia.NaoDesonerado)","v":1.42},{"$f":"ROUND(IF(ISNUMBER(R41),R41,IF(LEFT(R41,3)=\"BDI\",HLOOKUP(R41,DADOS!$T$37:$X$38,2,FALSE),0)),15-11*$X$5)","v":0.22}]
["S",0,1,4,0,0,8,0,0,"Serviço","1.4.8.","SINAPI","73806/001","Limpeza do pavimento","m²",{"$f":"OFFSET(PLQ!$E$12,ROW($P42)-ROW(P$12),0)","v":4134},1.64,"BDI 1",2,8268,"",{"$f":"IF(OR($A42=0,$A42=\"S\",$A42>CFF!$A$9),\"\",MAX(V$12:OFFSET(V42,-1,0))+1)","v":""},"SINAPI-73806/001",11174,{"$f":"IF(Import.Desoneracao=\"sim\",Referencia.Desonerado,Referencia.NaoDesonerado)","v":1.66},{"$f":"ROUND(IF(ISNUMBER(R42),R42,IF(LEFT(R42,3)=\"BDI\",HLOOKUP(R42,DADOS!$T$37:$X$38,2,FALSE),0)),15-11*$X$5)","v":0.22}]
["S",0,1,4,0,0,9,0,0,"Serviço","1.4.9.","SINAPI",72943,"Pintura de Ligação com emulsão RR-2C - taxa = 0,50 L/m²","m²",{"$f":"OFFSET(PLQ!$E$12,ROW($P43)-ROW(P$12),0)","v":4134},1.27,"BDI 1",1.55,6407.7,"",{"$f":"IF(OR($A43=0,$A43=\"S\",$A43>CFF!$A$9),\"\",MAX(V$12:OFFSET(V43,-1,0))+1)","v":""},"SINAPI-72943",10334,{"$f":"IF(Import.Desoneracao=\"sim\",Referencia.Desonerado,Referencia.NaoDesonerado)","v":1.29},{"$f":"ROUND(IF(ISNUMBER(R43),R43,IF(LEFT(R43,3)=\"BDI\",HLOOKUP(R43,DADOS!$T$37:$X$38,2,FALSE),0)),15-11*$X$5)","v":0.22}]
["S",0,1,4,0,0,10,0,0,"Serviço","1.4.10.","SINAPI",72943,"Pintura de Ligação com emulsão RR-2C - taxa = 0,30 L/m²","m²",{"$f":"OFFSET(PLQ!$E$12,ROW($P44)-ROW(P$12),0)","v":4134},0.74,"BDI 1",0.9,3720.6,"",{"$f":"IF(OR($A44=0,$A44=\"S\",$A44>CFF!$A$9),\"\",MAX(V$12:OFFSET(V44,-1,0))+1)","v":""},"SINAPI-72943",10334,{"$f":"IF(Import.Desoneracao=\"sim\",Referencia.Desonerado,Referencia.NaoDesonerado)","v":1.29},{"$f":"ROUND(IF(ISNUMBER(R44),R44,IF(LEFT(R44,3)=\"BDI\",HLOOKUP(R44,DADOS!$T$37:$X$38,2,FALSE),0)),15-11*$X$5)","v":0.22}]
["S",0,1,4,0,0,11,0,0,"Serviço","1.4.11.","SINAPI",93177,"Transporte de material betuminoso RR-2C - DMT = 60 Km","Txkm",{"$f":"OFFSET(PLQ!$E$12,ROW($P45)-ROW(P$12),0)","v":165.4},1.42,"BDI 1",1.73,286.14,"",{"$f":"IF(OR($A45=0,$A45=\"S\",$A45>CFF!$A$9),\"\",MAX(V$12:OFFSET(V45,-1,0))+1)","v":""},"SINAPI-93177",11398,{"$f":"IF(Import.Desoneracao=\"sim\",Referencia.Desonerado,Referencia.NaoDesonerado)","v":1.42},{"$f":"ROUND(IF(ISNUMBER(R45),R45,IF(LEFT(R45,3)=\"BDI\",HLOOKUP(R45,DADOS!$T$37:$X$38,2,FALSE),0)),15-11*$X$5)","v":0.22}]
["S",0,1,4,0,0,12,0,0,"Serviço","1.4.12.","SINAPI",95994,"Reperfilagem com concreto asfáltico usinado à quente (e= 4 cm)","m³",{"$f":"OFFSET(PLQ!$E$12,ROW($P46)-ROW(P$12),0)","v":165.4},487.01,"BDI 1",594.15,98272.41,"",{"$f":"IF(OR($A46=0,$A46=\"S\",$A46>CFF!$A$9),\"\",MAX(V$12:OFFSET(V46,-1,0))+1)","v":""},"SINAPI-95994",10380,{"$f":"IF(Import.Desoneracao=\"sim\",Referencia.Desonerado,Referencia.NaoDesonerado)","v":585.73},{"$f":"ROUND(IF(ISNUMBER(R46),R46,IF(LEFT(R46,3)=\"BDI\",HLOOKUP(R46,DADOS!$T$37:$X$38,2,FALSE),0)),15-11*$X$5)","v":0.22}]
["S",0,1,4,0,0,13,0,0,"Serviço","1.4.13.","SINAPI",95990,"Camada de concreto asfáltico usinado à quente (esp.= 3)","m³",{"$f":"OFFSET(PLQ!$E$12,ROW($P47)-ROW(P$12),0)","v":124},530,"BDI 1",646.6,80178.399999999994,"",{"$f":"IF(OR($A47=0,$A47=\"S\",$A47>CFF!$A$9),\"\",MAX(V$12:OFFSET(V47,-1,0))+1)","v":""},"SINAPI-95990",10377,{"$f":"IF(Import.Desoneracao=\"sim\",Referencia.Desonerado,Referencia.NaoDesonerado)","v":652.84},{"$f":"ROUND(IF(ISNUMBER(R47),R47,IF(LEFT(R47,3)=\"BDI\",HLOOKUP(R47,DADOS!$T$37:$X$38,2,FALSE),0)),15-11*$X$5)","v":0.22}]
["S",0,1,4,0,0,14,0,0,"Serviço","1.4.14.","SINAPI","72887","Transporte de massa asfáltica - DMT = 50 Km","m³xkm",{"$f":"OFFSET(PLQ!$E$12,ROW($P48)-ROW(P$12),0)","v":14470},0.9,"BDI 1",1.1000000000000001,15917,"",{"$f":"IF(OR($A48=0,$A48=\"S\",$A48>CFF!$A$9),\"\",MAX(V$12:OFFSET(V48,-1,0))+1)","v":""},"SINAPI-72887",10056,{"$f":"IF(Import.Desoneracao=\"sim\",Referencia.Desonerado,Referencia.NaoDesonerado)","v":1},{"$f":"ROUND(IF(ISNUMBER(R48),R48,IF(LEFT(R48,3)=\"BDI\",HLOOKUP(R48,DADOS!$T$37:$X$38,2,FALSE),0)),15-11*$X$5)","v":0.22}]
["S",0,1,4,0,0,15,0,0,"Serviço","1.4.15.","SINAPI",85335,"Retirada de meio-fio pré-moldado","m",{"$f":"OFFSET(PLQ!$E$12,ROW($P49)-ROW(P$12),0)","v":237},7.94,"BDI 1",9.69,2296.5300000000002,"",{"$f":"IF(OR($A49=0,$A49=\"S\",$A49>CFF!$A$9),\"\",MAX(V$12:OFFSET(V49,-1,0))+1)","v":""},"SINAPI-85335",11259,{"$f":"IF(Import.Desoneracao=\"sim\",Referencia.Desonerado,Referencia.NaoDesonerado)","v":7.94},{"$f":"ROUND(IF(ISNUMBER(R49),R49,IF(LEFT(R49,3)=\"BDI\",HLOOKUP(R49,DADOS!$T$37:$X$38,2,FALSE),0)),15-11*$X$5)","v":0.22}]
[{"$f":"CHOOSE(1+LOG(1+2*(J50=\"Meta\")+4*(J50=\"Nível 2\")+8*(J50=\"Nível 3\")+16*(J50=\"Nível 4\")+32*(J50=\"Serviço\"),2),0,1,2,3,4,\"S\")","v":"S"},{"$f":"IF(OR(A50=\"S\",A50=0),0,IF(ISERROR(I50),H50,SMALL(H50:I50,1)))","v":0},{"$f":"IF($A50=1,OFFSET(C50,-1,0)+1,OFFSET(C50,-1,0))","v":1},{"$f":"IF($A50=1,0,IF($A50=2,OFFSET(D50,-1,0)+1,OFFSET(D50,-1,0)))","v":4},{"$f":"IF(AND($A50<=2,$A50<>0),0,IF($A50=3,OFFSET(E50,-1,0)+1,OFFSET(E50,-1,0)))","v":0},{"$f":"IF(AND($A50<=3,$A50<>0),0,IF($A50=4,OFFSET(F50,-1,0)+1,OFFSET(F50,-1,0)))","v":0},{"$f":"IF(AND($A50<=4,$A50<>0),0,IF($A50=\"S\",OFFSET(G50,-1,0)+1,OFFSET(G50,-1,0)))","v":16},0,0,"Serviço",{"$f":"IF($A50=0,\"-\",CONCATENATE(C50&\".\",IF(AND($A$5>=2,$A50>=2),D50&\".\",\"\"),IF(AND($A$5>=3,$A50>=3),E50&\".\",\"\"),IF(AND($A$5>=4,$A50>=4),F50&\".\",\"\"),IF($A50=\"S\",G50&\".\",\"\")))","v":"1.4.16."},"composição","004","Assentamento de meio-fio pré-moldado","m",{"$f":"OFFSET(PLQ!$E$12,ROW($P50)-ROW(P$12),0)","v":228},16.149999999999999,"BDI 1",{"$f":"IF($A50=\"S\",IF($Q$10=\"Preço Unitário (R$)\",PO.CustoUnitario,ROUND(PO.CustoUnitario*(1+$Z50),15-13*$X$6)),0)","v":19.7},{"$f":"IF($A50=\"S\",VTOTAL1,IF($A50=0,0,ROUND(SomaAgrup,15-13*$X$7)))","v":4491.6000000000004},{"$f":"IF($J50=\"\",\"\",IF($N50=\"\",\"DESCRIÇÃO\",IF(AND($J50=\"Serviço\",$O50=\"\"),\"UNIDADE\",IF($T50<=0,\"SEM VALOR\",IF(AND($Y50<>\"\",$Q50>$Y50),\"ACIMA REF.\",\"\")))))","v":""},{"$f":"IF(OR($A50=0,$A50=\"S\",$A50>CFF!$A$9),\"\",MAX(V$12:OFFSET(V50,-1,0))+1)","v":""},{"$f":"IF(AND($J50=\"Serviço\",$M50<>\"\"),IF($L50=\"\",$M50,CONCATENATE($L50,\"-\",$M50)))","v":"composição-004"},{"$f":"IF(AND(Fonte<>\"\",Código<>\"\"),MATCH(Fonte&\" \"&IF(Fonte=\"sinapi\",SUBSTITUTE(SUBSTITUTE(Código,\"/00\",\"/\"),\"/0\",\"/\"),Código),INDIRECT(\"'[Referência \"&_xlnm.Database&\".xls]Banco'!$a:$a\"),0),\"X\")","v":12},{"$f":"IF(Import.Desoneracao=\"sim\",Referencia.Desonerado,Referencia.NaoDesonerado)","v":19.61},{"$f":"ROUND(IF(ISNUMBER(R50),R50,IF(LEFT(R50,3)=\"BDI\",HLOOKUP(R50,DADOS!$T$37:$X$38,2,FALSE),0)),15-11*$X$5)","v":0.22}]
["S",0,1,4,0,0,17,0,0,"Serviço","1.4.17.","SINAPI",94273,"Meio-fio pré-moldado 15 x 13 x 30 x 50 cm","m",{"$f":"OFFSET(PLQ!$E$12,ROW($P51)-ROW(P$12),0)","v":53},29,"BDI 1",35.380000000000003,1875.14,"",{"$f":"IF(OR($A51=0,$A51=\"S\",$A51>CFF!$A$9),\"\",MAX(V$12:OFFSET(V51,-1,0))+1)","v":""},"SINAPI-94273",7105,{"$f":"IF(Import.Desoneracao=\"sim\",Referencia.Desonerado,Referencia.NaoDesonerado)","v":31.84},{"$f":"ROUND(IF(ISNUMBER(R51),R51,IF(LEFT(R51,3)=\"BDI\",HLOOKUP(R51,DADOS!$T$37:$X$38,2,FALSE),0)),15-11*$X$5)","v":0.22}]
["S",0,1,4,0,0,18,0,0,"Serviço","1.4.18.","SINAPI","74020/002","Ensaios e laudos atestando teor de cap, densidade, espessura. (A cada 50 m)","m³",{"$f":"OFFSET(PLQ!$E$12,ROW($P52)-ROW(P$12),0)","v":289.39999999999998},19,"BDI 1",23.18,6708.29,"",{"$f":"IF(OR($A52=0,$A52=\"S\",$A52>CFF!$A$9),\"\",MAX(V$12:OFFSET(V52,-1,0))+1)","v":""},"SINAPI-74020/002",11295,{"$f":"IF(Import.Desoneracao=\"sim\",Referencia.Desonerado,Referencia.NaoDesonerado)","v":19.13},{"$f":"ROUND(IF(ISNUMBER(R52),R52,IF(LEFT(R52,3)=\"BDI\",HLOOKUP(R52,DADOS!$T$37:$X$38,2,FALSE),0)),15-11*$X$5)","v":0.22}]
[2,{"$f":"IF(OR(A53=\"S\",A53=0),0,IF(ISERROR(I53),H53,SMALL(H53:I53,1)))","v":6},1,5,0,0,0,6,{"$error":"#N/A"},"Nível 2","1.5.",null,null,"SINALIZAÇÃO","",{"$f":"OFFSET(PLQ!$E$12,ROW($P53)-ROW(P$12),0)","v":0},null,"BDI 1",0,7725.49,"",{"$f":"IF(OR($A53=0,$A53=\"S\",$A53>CFF!$A$9),\"\",MAX(V$12:OFFSET(V53,-1,0))+1)","v":6},false,"X",{"$f":"IF(Import.Desoneracao=\"sim\",Referencia.Desonerado,Referencia.NaoDesonerado)","v":0},{"$f":"ROUND(IF(ISNUMBER(R53),R53,IF(LEFT(R53,3)=\"BDI\",HLOOKUP(R53,DADOS!$T$37:$X$38,2,FALSE),0)),15-11*$X$5)","v":0.22}]
["S",0,1,5,0,0,1,0,0,"Serviço","1.5.1.","SINAPI",72947,"Pintura de faixa horizontal amarela - 10 cm","m²",{"$f":"OFFSET(PLQ!$E$12,ROW($P54)-ROW(P$12),0)","v":45.5},20.64,"BDI 1",25.18,1145.69,"",{"$f":"IF(OR($A54=0,$A54=\"S\",$A54>CFF!$A$9),\"\",MAX(V$12:OFFSET(V54,-1,0))+1)","v":""},"SINAPI-72947",10369,{"$f":"IF(Import.Desoneracao=\"sim\",Referencia.Desonerado,Referencia.NaoDesonerado)","v":20.64},{"$f":"ROUND(IF(ISNUMBER(R54),R54,IF(LEFT(R54,3)=\"BDI\",HLOOKUP(R54,DADOS!$T$37:$X$38,2,FALSE),0)),15-11*$X$5)","v":0.22}]
["S",0,1,5,0,0,2,0,0,"Serviço","1.5.2.","SINAPI",72947,"Pintura de faixa horizontal branca - 12 cm","m²",{"$f":"OFFSET(PLQ!$E$12,ROW($P55)-ROW(P$12),0)","v":50.1},20.64,"BDI 1",25.18,1261.52,"",{"$f":"IF(OR($A55=0,$A55=\"S\",$A55>CFF!$A$9),\"\",MAX(V$12:OFFSET(V55,-1,0))+1)","v":""},"SINAPI-72947",10369,{"$f":"IF(Import.Desoneracao=\"sim\",Referencia.Desonerado,Referencia.NaoDesonerado)","v":20.64},{"$f":"ROUND(IF(ISNUMBER(R55),R55,IF(LEFT(R55,3)=\"BDI\",HLOOKUP(R55,DADOS!$T$37:$X$38,2,FALSE),0)),15-11*$X$5)","v":0.22}]
[{"$f":"CHOOSE(1+LOG(1+2*(J56=\"Meta\")+4*(J56=\"Nível 2\")+8*(J56=\"Nível 3\")+16*(J56=\"Nível 4\")+32*(J56=\"Serviço\"),2),0,1,2,3,4,\"S\")","v":"S"},{"$f":"IF(OR(A56=\"S\",A56=0),0,IF(ISERROR(I56),H56,SMALL(H56:I56,1)))","v":0},1,5,0,0,3,0,0,"Serviço","1.5.3.","SINAPI",72947,"Pintura de faixas de pedestres branca - 40 cm","m²",{"$f":"OFFSET(PLQ!$E$12,ROW($P56)-ROW(P$12),0)","v":136.80000000000001},20.64,"BDI 1",25.18,3444.62,"",{"$f":"IF(OR($A56=0,$A56=\"S\",$A56>CFF!$A$9),\"\",MAX(V$12:OFFSET(V56,-1,0))+1)","v":""},"SINAPI-72947",10369,{"$f":"IF(Import.Desoneracao=\"sim\",Referencia.Desonerado,Referencia.NaoDesonerado)","v":20.64},{"$f":"ROUND(IF(ISNUMBER(R56),R56,IF(LEFT(R56,3)=\"BDI\",HLOOKUP(R56,DADOS!$T$37:$X$38,2,FALSE),0)),15-11*$X$5)","v":0.22}]
[{"$f":"CHOOSE(1+LOG(1+2*(J57=\"Meta\")+4*(J57=\"Nível 2\")+8*(J57=\"Nível 3\")+16*(J57=\"Nível 4\")+32*(J57=\"Serviço\"),2),0,1,2,3,4,\"S\")","v":"S"},{"$f":"IF(OR(A57=\"S\",A57=0),0,IF(ISERROR(I57),H57,SMALL(H57:I57,1)))","v":0},1,5,0,0,4,0,0,"Serviço","1.5.4.","SINAPI",91131,"Placa Octogonal \"PARE\" com L=25 cm - Totalmente refletiva, com suporte de aço galvanizado Ø 50 mm","unid.",{"$f":"OFFSET(PLQ!$E$12,ROW($P57)-ROW(P$12),0)","v":1},313,"BDI 1",381.86,381.86,"",{"$f":"IF(OR($A57=0,$A57=\"S\",$A57>CFF!$A$9),\"\",MAX(V$12:OFFSET(V57,-1,0))+1)","v":""},"SINAPI-91131",5621,{"$f":"IF(Import.Desoneracao=\"sim\",Referencia.Desonerado,Referencia.NaoDesonerado)","v":313.01},{"$f":"ROUND(IF(ISNUMBER(R57),R57,IF(LEFT(R57,3)=\"BDI\",HLOOKUP(R57,DADOS!$T$37:$X$38,2,FALSE),0)),15-11*$X$5)","v":0.22}]
[{"$f":"CHOOSE(1+LOG(1+2*(J58=\"Meta\")+4*(J58=\"Nível 2\")+8*(J58=\"Nível 3\")+16*(J58=\"Nível 4\")+32*(J58=\"Serviço\"),2),0,1,2,3,4,\"S\")","v":"S"},{"$f":"IF(OR(A58=\"S\",A58=0),0,IF(ISERROR(I58),H58,SMALL(H58:I58,1)))","v":0},1,5,0,0,5,0,0,"Serviço","1.5.5.","SINAPI",94802,"Placa de Identificação de ruas - com suporte de aço galvanizado Ø 50 mm","unid.",{"$f":"OFFSET(PLQ!$E$12,ROW($P58)-ROW(P$12),0)","v":4},305.7,"BDI 1",372.95,1491.8,"",{"$f":"IF(OR($A58=0,$A58=\"S\",$A58>CFF!$A$9),\"\",MAX(V$12:OFFSET(V58,-1,0))+1)","v":""},"SINAPI-94802",5624,{"$f":"IF(Import.Desoneracao=\"sim\",Referencia.Desonerado,Referencia.NaoDesonerado)","v":305.7},{"$f":"ROUND(IF(ISNUMBER(R58),R58,IF(LEFT(R58,3)=\"BDI\",HLOOKUP(R58,DADOS!$T$37:$X$38,2,FALSE),0)),15-11*$X$5)","v":0.22}]
[-1,null,0,0,0,0,0]
[null,null,null,null,null,null,null,null,null,null,"Encargos sociais:",null,"Para elaboração deste orçamento, foram utilizados os encargos sociais do SINAPI para a Unidade da Federação indicada."]
[]
[null,null,null,null,null,null,null,null,null,null,"Observações:"]
[]
[]
[]
[]
[null,null,null,null,null,null,null,null,null,null,{"$f":"IF(AND($X$3=FALSE,$X$4=FALSE,$X$5=FALSE,$X$6=FALSE,$X$7=FALSE),\"Não foi considerado arredondamento nos valores da planilha.\",CONCATENATE(\"Foi considerado arredondamento de duas casas decimais para \",IF($X$3=TRUE,\"Quantidade; \",\"\"),IF($X$4=TRUE,\"Custo Unitário; \",\"\"),IF($X$5=TRUE,\"BDI; \",\"\"),IF($X$6=TRUE,\"Preço Unitário; \",\"\"),IF($X$7=TRUE,\"Preço Total.\",\"\")))","v":"Foi considerado arredondamento de duas casas decimais para Quantidade; Custo Unitário; BDI; Preço Unitário; Preço Total."}]
[]
[]
[null,null,null,null,null,null,null,null,null,null,{"$f":"Import.Município","v":"Bom Jesus / SC"}]
[null,null,null,null,null,null,null,null,null,null,"Local"]
[]
[null,null,null,null,null,null,null,null,null,null,{"$f":"TODAY()","v":"2018-01-25"}]
[null,null,null,null,null,null,null,null,null,null,"Data"]

{"sheet":"PLQ","index":3,"n_rows":65,"n_cols":21,"rows_kept":65,"cut":false,"hidden":false,"merged":[[60,1,60,2],[63,1,63,2]]}
[null,null,null,null,"PLQ -","PLANILHA DE LEVANTAMENTO DE QUANTIDADES"]
[]
[]
[]
[]
[]
[null,null,null,null,{"$f":"OFFSET(PO!$P$12,ROW($E7)-ROW(E$12),0)","v":0}]
[]
[null,null,null,null,"-","Estaca 00 á estaca 5 + 11 m","Estaca 5 + 11 m á estaca 10 + 6,50 m","Estaca 10 + 6,50 m á estaca 15 + 1,10 m"]
["Nível","Item","Descrição","Unid.","Quantidade",{"$f":"IF(OFFSET(F10,0,-1)=\"Quantidade\",1,OFFSET(F10,0,-1)+1)","v":1},2,3,4,5,6,7,8,9,10,null,null,null,null,null,{"$f":"IF(OFFSET(U10,0,-1)=\"Quantidade\",1,OFFSET(U10,0,-1)+1)","v":1}]
[{"$f":"OFFSET(PO!J$12,ROW(A11)-ROW($A$12),0)","v":"Serviço"},{"$f":"IF($A11=0,\"\",OFFSET(PO!K$12,ROW(B11)-ROW(B$12),0))","v":{"$error":"#VALUE!"}},{"$f":"IF(OFFSET(PO!N$12,ROW(C11)-ROW(C$12),0)=0,\"\",OFFSET(PO!N$12,ROW(C11)-ROW(C$12),0))","v":""},{"$f":"IF(OFFSET(PO!O$12,ROW(D11)-ROW(D$12),0)=0,\"\",OFFSET(PO!O$12,ROW(D11)-ROW(D$12),0))","v":""},{"$f":"IF($A11<>\"Serviço\",0,ROUND(SUMIF($F$9:$P$9,\"<>\",$F11:$P11),15-13*PO!$X$3))","v":0}]
[{"$f":"PO!J12","v":"LOTE"},null,{"$f":"PO!N12","v":"Lote 01"}]
[{"$f":"OFFSET(PO!J$12,ROW(A13)-ROW($A$12),0)","v":"Meta"},{"$f":"IF($A13=0,\"\",OFFSET(PO!K$12,ROW(B13)-ROW(B$12),0))","v":"1."},{"$f":"IF(OFFSET(PO!N$12,ROW(C13)-ROW(C$12),0)=0,\"\",OFFSET(PO!N$12,ROW(C13)-ROW(C$12),0))","v":"PAVIMENTAÇÃO"},{"$f":"IF(OFFSET(PO!O$12,ROW(D13)-ROW(D$12),0)=0,\"\",OFFSET(PO!O$12,ROW(D13)-ROW(D$12),0))","v":""},{"$f":"IF($A13<>\"Serviço\",0,ROUND(SUMIF($F$9:$P$9,\"<>\",$F13:$P13),15-13*PO!$X$3))","v":0},0]
[{"$f":"OFFSET(PO!J$12,ROW(A14)-ROW($A$12),0)","v":"Nível 2"},{"$f":"IF($A14=0,\"\",OFFSET(PO!K$12,ROW(B14)-ROW(B$12),0))","v":"1.1."},{"$f":"IF(OFFSET(PO!N$12,ROW(C14)-ROW(C$12),0)=0,\"\",OFFSET(PO!N$12,ROW(C14)-ROW(C$12),0))","v":"SERVIÇOS INICIAS"},{"$f":"IF(OFFSET(PO!O$12,ROW(D14)-ROW(D$12),0)=0,\"\",OFFSET(PO!O$12,ROW(D14)-ROW(D$12),0))","v":""},{"$f":"IF($A14<>\"Serviço\",0,ROUND(SUMIF($F$9:$P$9,\"<>\",$F14:$P14),15-13*PO!$X$3))","v":0},0]
[{"$f":"OFFSET(PO!J$12,ROW(A15)-ROW($A$12),0)","v":"Serviço"},{"$f":"IF($A15=0,\"\",OFFSET(PO!K$12,ROW(B15)-ROW(B$12),0))","v":"1.1.1."},{"$f":"IF(OFFSET(PO!N$12,ROW(C15)-ROW(C$12),0)=0,\"\",OFFSET(PO!N$12,ROW(C15)-ROW(C$12),0))","v":"Placa de obra em chapa de aço galvanizado 1,25 x 2,00 m"},{"$f":"IF(OFFSET(PO!O$12,ROW(D15)-ROW(D$12),0)=0,\"\",OFFSET(PO!O$12,ROW(D15)-ROW(D$12),0))","v":"m²"},{"$f":"IF($A15<>\"Serviço\",0,ROUND(SUMIF($F$9:$P$9,\"<>\",$F15:$P15),15-13*PO!$X$3))","v":2.5},2.5]
[{"$f":"OFFSET(PO!J$12,ROW(A16)-ROW($A$12),0)","v":"Serviço"},{"$f":"IF($A16=0,\"\",OFFSET(PO!K$12,ROW(B16)-ROW(B$12),0))","v":"1.1.2."},{"$f":"IF(OFFSET(PO!N$12,ROW(C16)-ROW(C$12),0)=0,\"\",OFFSET(PO!N$12,ROW(C16)-ROW(C$12),0))","v":"Engenheiro Civil"},{"$f":"IF(OFFSET(PO!O$12,ROW(D16)-ROW(D$12),0)=0,\"\",OFFSET(PO!O$12,ROW(D16)-ROW(D$12),0))","v":"h"},{"$f":"IF($A16<>\"Serviço\",0,ROUND(SUMIF($F$9:$P$9,\"<>\",$F16:$P16),15-13*PO!$X$3))","v":24},8,8,8]
[{"$f":"OFFSET(PO!J$12,ROW(A17)-ROW($A$12),0)","v":"Serviço"},{"$f":"IF($A17=0,\"\",OFFSET(PO!K$12,ROW(B17)-ROW(B$12),0))","v":"1.1.3."},{"$f":"IF(OFFSET(PO!N$12,ROW(C17)-ROW(C$12),0)=0,\"\",OFFSET(PO!N$12,ROW(C17)-ROW(C$12),0))","v":"Mestre de obras"},{"$f":"IF(OFFSET(PO!O$12,ROW(D17)-ROW(D$12),0)=0,\"\",OFFSET(PO!O$12,ROW(D17)-ROW(D$12),0))","v":"h"},{"$f":"IF($A17<>\"Serviço\",0,ROUND(SUMIF($F$9:$P$9,\"<>\",$F17:$P17),15-13*PO!$X$3))","v":40},15,15,10]
[{"$f":"OFFSET(PO!J$12,ROW(A18)-ROW($A$12),0)","v":"Serviço"},{"$f":"IF($A18=0,\"\",OFFSET(PO!K$12,ROW(B18)-ROW(B$12),0))","v":"1.1.4."},{"$f":"IF(OFFSET(PO!N$12,ROW(C18)-ROW(C$12),0)=0,\"\",OFFSET(PO!N$12,ROW(C18)-ROW(C$12),0))","v":"Locação de obra de pavimentação asfaltica com equipe de topografia"},{"$f":"IF(OFFSET(PO!O$12,ROW(D18)-ROW(D$12),0)=0,\"\",OFFSET(PO!O$12,ROW(D18)-ROW(D$12),0))","v":"h"},{"$f":"IF($A18<>\"Serviço\",0,ROUND(SUMIF($F$9:$P$9,\"<>\",$F18:$P18),15-13*PO!$X$3))","v":5},2,1,2]
[{"$f":"OFFSET(PO!J$12,ROW(A19)-ROW($A$12),0)","v":"Nível 2"},{"$f":"IF($A19=0,\"\",OFFSET(PO!K$12,ROW(B19)-ROW(B$12),0))","v":"1.2."},{"$f":"IF(OFFSET(PO!N$12,ROW(C19)-ROW(C$12),0)=0,\"\",OFFSET(PO!N$12,ROW(C19)-ROW(C$12),0))","v":"MOBILIZAÇÃO E DESMOBILIZAÇÃO"},{"$f":"IF(OFFSET(PO!O$12,ROW(D19)-ROW(D$12),0)=0,\"\",OFFSET(PO!O$12,ROW(D19)-ROW(D$12),0))","v":""},{"$f":"IF($A19<>\"Serviço\",0,ROUND(SUMIF($F$9:$P$9,\"<>\",$F19:$P19),15-13*PO!$X$3))","v":0},0]
[{"$f":"OFFSET(PO!J$12,ROW(A20)-ROW($A$12),0)","v":"Serviço"},{"$f":"IF($A20=0,\"\",OFFSET(PO!K$12,ROW(B20)-ROW(B$12),0))","v":"1.2.1."},{"$f":"IF(OFFSET(PO!N$12,ROW(C20)-ROW(C$12),0)=0,\"\",OFFSET(PO!N$12,ROW(C20)-ROW(C$12),0))","v":"Mobilização"},{"$f":"IF(OFFSET(PO!O$12,ROW(D20)-ROW(D$12),0)=0,\"\",OFFSET(PO!O$12,ROW(D20)-ROW(D$12),0))","v":"unid."},{"$f":"IF($A20<>\"Serviço\",0,ROUND(SUMIF($F$9:$P$9,\"<>\",$F20:$P20),15-13*PO!$X$3))","v":1},1]
[{"$f":"OFFSET(PO!J$12,ROW(A21)-ROW($A$12),0)","v":"Serviço"},{"$f":"IF($A21=0,\"\",OFFSET(PO!K$12,ROW(B21)-ROW(B$12),0))","v":"1.2.2."},{"$f":"IF(OFFSET(PO!N$12,ROW(C21)-ROW(C$12),0)=0,\"\",OFFSET(PO!N$12,ROW(C21)-ROW(C$12),0))","v":"Desmobilização"},{"$f":"IF(OFFSET(PO!O$12,ROW(D21)-ROW(D$12),0)=0,\"\",OFFSET(PO!O$12,ROW(D21)-ROW(D$12),0))","v":"unid."},{"$f":"IF($A21<>\"Serviço\",0,ROUND(SUMIF($F$9:$P$9,\"<>\",$F21:$P21),15-13*PO!$X$3))","v":1},null,null,1]
[{"$f":"OFFSET(PO!J$12,ROW(A22)-ROW($A$12),0)","v":"Nível 2"},{"$f":"IF($A22=0,\"\",OFFSET(PO!K$12,ROW(B22)-ROW(B$12),0))","v":"1.3."},{"$f":"IF(OFFSET(PO!N$12,ROW(C22)-ROW(C$12),0)=0,\"\",OFFSET(PO!N$12,ROW(C22)-ROW(C$12),0))","v":"DRENAGEM"},{"$f":"IF(OFFSET(PO!O$12,ROW(D22)-ROW(D$12),0)=0,\"\",OFFSET(PO!O$12,ROW(D22)-ROW(D$12),0))","v":""},{"$f":"IF($A22<>\"Serviço\",0,ROUND(SUMIF($F$9:$P$9,\"<>\",$F22:$P22),15-13*PO!$X$3))","v":0},0]
[{"$f":"OFFSET(PO!J$12,ROW(A23)-ROW($A$12),0)","v":"Serviço"},{"$f":"IF($A23=0,\"\",OFFSET(PO!K$12,ROW(B23)-ROW(B$12),0))","v":"1.3.1."},{"$f":"IF(OFFSET(PO!N$12,ROW(C23)-ROW(C$12),0)=0,\"\",OFFSET(PO!N$12,ROW(C23)-ROW(C$12),0))","v":"Assentamentos de tubos BSTC Ø 400mm"},{"$f":"IF(OFFSET(PO!O$12,ROW(D23)-ROW(D$12),0)=0,\"\",OFFSET(PO!O$12,ROW(D23)-ROW(D$12),0))","v":"m"},{"$f":"IF($A23<>\"Serviço\",0,ROUND(SUMIF($F$9:$P$9,\"<>\",$F23:$P23),15-13*PO!$X$3))","v":12},null,12]
[{"$f":"OFFSET(PO!J$12,ROW(A24)-ROW($A$12),0)","v":"Serviço"},{"$f":"IF($A24=0,\"\",OFFSET(PO!K$12,ROW(B24)-ROW(B$12),0))","v":"1.3.2."},{"$f":"IF(OFFSET(PO!N$12,ROW(C24)-ROW(C$12),0)=0,\"\",OFFSET(PO!N$12,ROW(C24)-ROW(C$12),0))","v":"Tubo de concreto simples 400 mm Classe PS1"},{"$f":"IF(OFFSET(PO!O$12,ROW(D24)-ROW(D$12),0)=0,\"\",OFFSET(PO!O$12,ROW(D24)-ROW(D$12),0))","v":"m"},{"$f":"IF($A24<>\"Serviço\",0,ROUND(SUMIF($F$9:$P$9,\"<>\",$F24:$P24),15-13*PO!$X$3))","v":12},null,12]
[{"$f":"OFFSET(PO!J$12,ROW(A25)-ROW($A$12),0)","v":"Serviço"},{"$f":"IF($A25=0,\"\",OFFSET(PO!K$12,ROW(B25)-ROW(B$12),0))","v":"1.3.3."},{"$f":"IF(OFFSET(PO!N$12,ROW(C25)-ROW(C$12),0)=0,\"\",OFFSET(PO!N$12,ROW(C25)-ROW(C$12),0))","v":"Transporte comercial com caminhão carroceria 9 T - DMT = 50 Km"},{"$f":"IF(OFFSET(PO!O$12,ROW(D25)-ROW(D$12),0)=0,\"\",OFFSET(PO!O$12,ROW(D25)-ROW(D$12),0))","v":"Txkm"},{"$f":"IF($A25<>\"Serviço\",0,ROUND(SUMIF($F$9:$P$9,\"<>\",$F25:$P25),15-13*PO!$X$3))","v":71.7},null,71.7]
[{"$f":"OFFSET(PO!J$12,ROW(A26)-ROW($A$12),0)","v":"Serviço"},{"$f":"IF($A26=0,\"\",OFFSET(PO!K$12,ROW(B26)-ROW(B$12),0))","v":"1.3.4."},{"$f":"IF(OFFSET(PO!N$12,ROW(C26)-ROW(C$12),0)=0,\"\",OFFSET(PO!N$12,ROW(C26)-ROW(C$12),0))","v":"Escavação de valas p/ galerias tubulares"},{"$f":"IF(OFFSET(PO!O$12,ROW(D26)-ROW(D$12),0)=0,\"\",OFFSET(PO!O$12,ROW(D26)-ROW(D$12),0))","v":"m³"},{"$f":"IF($A26<>\"Serviço\",0,ROUND(SUMIF($F$9:$P$9,\"<>\",$F26:$P26),15-13*PO!$X$3))","v":14.4},null,14.4]
[{"$f":"OFFSET(PO!J$12,ROW(A27)-ROW($A$12),0)","v":"Serviço"},{"$f":"IF($A27=0,\"\",OFFSET(PO!K$12,ROW(B27)-ROW(B$12),0))","v":"1.3.5."},{"$f":"IF(OFFSET(PO!N$12,ROW(C27)-ROW(C$12),0)=0,\"\",OFFSET(PO!N$12,ROW(C27)-ROW(C$12),0))","v":"Reaterro de valas p/ galerias tubulares"},{"$f":"IF(OFFSET(PO!O$12,ROW(D27)-ROW(D$12),0)=0,\"\",OFFSET(PO!O$12,ROW(D27)-ROW(D$12),0))","v":"m³"},{"$f":"IF($A27<>\"Serviço\",0,ROUND(SUMIF($F$9:$P$9,\"<>\",$F27:$P27),15-13*PO!$X$3))","v":10},null,10]
[{"$f":"OFFSET(PO!J$12,ROW(A28)-ROW($A$12),0)","v":"Serviço"},{"$f":"IF($A28=0,\"\",OFFSET(PO!K$12,ROW(B28)-ROW(B$12),0))","v":"1.3.6."},{"$f":"IF(OFFSET(PO!N$12,ROW(C28)-ROW(C$12),0)=0,\"\",OFFSET(PO!N$12,ROW(C28)-ROW(C$12),0))","v":"Recomposição com base de brita graduada compacatada - esp 30 cm"},{"$f":"IF(OFFSET(PO!O$12,ROW(D28)-ROW(D$12),0)=0,\"\",OFFSET(PO!O$12,ROW(D28)-ROW(D$12),0))","v":"m³"},{"$f":"IF($A28<>\"Serviço\",0,ROUND(SUMIF($F$9:$P$9,\"<>\",$F28:$P28),15-13*PO!$X$3))","v":2.9},null,2.9]
[{"$f":"OFFSET(PO!J$12,ROW(A29)-ROW($A$12),0)","v":"Serviço"},{"$f":"IF($A29=0,\"\",OFFSET(PO!K$12,ROW(B29)-ROW(B$12),0))","v":"1.3.7."},{"$f":"IF(OFFSET(PO!N$12,ROW(C29)-ROW(C$12),0)=0,\"\",OFFSET(PO!N$12,ROW(C29)-ROW(C$12),0))","v":"Transporte de brita graduada - DMT = 50 Km"},{"$f":"IF(OFFSET(PO!O$12,ROW(D29)-ROW(D$12),0)=0,\"\",OFFSET(PO!O$12,ROW(D29)-ROW(D$12),0))","v":"m³xkm"},{"$f":"IF($A29<>\"Serviço\",0,ROUND(SUMIF($F$9:$P$9,\"<>\",$F29:$P29),15-13*PO!$X$3))","v":145},null,145]
[{"$f":"OFFSET(PO!J$12,ROW(A30)-ROW($A$12),0)","v":"Serviço"},{"$f":"IF($A30=0,\"\",OFFSET(PO!K$12,ROW(B30)-ROW(B$12),0))","v":"1.3.8."},{"$f":"IF(OFFSET(PO!N$12,ROW(C30)-ROW(C$12),0)=0,\"\",OFFSET(PO!N$12,ROW(C30)-ROW(C$12),0))","v":"Imprimação da Base com asfalto diluído CM 30 - taxa = 1,2 L/m²"},{"$f":"IF(OFFSET(PO!O$12,ROW(D30)-ROW(D$12),0)=0,\"\",OFFSET(PO!O$12,ROW(D30)-ROW(D$12),0))","v":"m²"},{"$f":"IF($A30<>\"Serviço\",0,ROUND(SUMIF($F$9:$P$9,\"<>\",$F30:$P30),15-13*PO!$X$3))","v":9.6},null,9.6]
[{"$f":"OFFSET(PO!J$12,ROW(A31)-ROW($A$12),0)","v":"Serviço"},{"$f":"IF($A31=0,\"\",OFFSET(PO!K$12,ROW(B31)-ROW(B$12),0))","v":"1.3.9."},{"$f":"IF(OFFSET(PO!N$12,ROW(C31)-ROW(C$12),0)=0,\"\",OFFSET(PO!N$12,ROW(C31)-ROW(C$12),0))","v":"Transporte de material betuminoso CM 30 - DMT = 50 Km"},{"$f":"IF(OFFSET(PO!O$12,ROW(D31)-ROW(D$12),0)=0,\"\",OFFSET(PO!O$12,ROW(D31)-ROW(D$12),0))","v":"Txkm"},{"$f":"IF($A31<>\"Serviço\",0,ROUND(SUMIF($F$9:$P$9,\"<>\",$F31:$P31),15-13*PO!$X$3))","v":0.6},null,0.6]
[{"$f":"OFFSET(PO!J$12,ROW(A32)-ROW($A$12),0)","v":"Serviço"},{"$f":"IF($A32=0,\"\",OFFSET(PO!K$12,ROW(B32)-ROW(B$12),0))","v":"1.3.10."},{"$f":"IF(OFFSET(PO!N$12,ROW(C32)-ROW(C$12),0)=0,\"\",OFFSET(PO!N$12,ROW(C32)-ROW(C$12),0))","v":"Caixa coletora tipo BL completa"},{"$f":"IF(OFFSET(PO!O$12,ROW(D32)-ROW(D$12),0)=0,\"\",OFFSET(PO!O$12,ROW(D32)-ROW(D$12),0))","v":"unid."},{"$f":"IF($A32<>\"Serviço\",0,ROUND(SUMIF($F$9:$P$9,\"<>\",$F32:$P32),15-13*PO!$X$3))","v":2},null,2]
[{"$f":"OFFSET(PO!J$12,ROW(A33)-ROW($A$12),0)","v":"Serviço"},{"$f":"IF($A33=0,\"\",OFFSET(PO!K$12,ROW(B33)-ROW(B$12),0))","v":"1.3.11."},{"$f":"IF(OFFSET(PO!N$12,ROW(C33)-ROW(C$12),0)=0,\"\",OFFSET(PO!N$12,ROW(C33)-ROW(C$12),0))","v":"Elevação de caixa coletora tipo boca de lobo, com reaproveitamento da grade de ferro"},{"$f":"IF(OFFSET(PO!O$12,ROW(D33)-ROW(D$12),0)=0,\"\",OFFSET(PO!O$12,ROW(D33)-ROW(D$12),0))","v":"unid."},{"$f":"IF($A33<>\"Serviço\",0,ROUND(SUMIF($F$9:$P$9,\"<>\",$F33:$P33),15-13*PO!$X$3))","v":17},6,7,4]
[{"$f":"OFFSET(PO!J$12,ROW(A34)-ROW($A$12),0)","v":"Nível 2"},{"$f":"IF($A34=0,\"\",OFFSET(PO!K$12,ROW(B34)-ROW(B$12),0))","v":"1.4."},{"$f":"IF(OFFSET(PO!N$12,ROW(C34)-ROW(C$12),0)=0,\"\",OFFSET(PO!N$12,ROW(C34)-ROW(C$12),0))","v":"PAVIMENTAÇÃO"},{"$f":"IF(OFFSET(PO!O$12,ROW(D34)-ROW(D$12),0)=0,\"\",OFFSET(PO!O$12,ROW(D34)-ROW(D$12),0))","v":""},{"$f":"IF($A34<>\"Serviço\",0,ROUND(SUMIF($F$9:$P$9,\"<>\",$F34:$P34),15-13*PO!$X$3))","v":0},0]
[{"$f":"OFFSET(PO!J$12,ROW(A35)-ROW($A$12),0)","v":"Serviço"},{"$f":"IF($A35=0,\"\",OFFSET(PO!K$12,ROW(B35)-ROW(B$12),0))","v":"1.4.1."},{"$f":"IF(OFFSET(PO!N$12,ROW(C35)-ROW(C$12),0)=0,\"\",OFFSET(PO!N$12,ROW(C35)-ROW(C$12),0))","v":"Escavação mecanizada - e: 25 cm"},{"$f":"IF(OFFSET(PO!O$12,ROW(D35)-ROW(D$12),0)=0,\"\",OFFSET(PO!O$12,ROW(D35)-ROW(D$12),0))","v":"m³"},{"$f":"IF($A35<>\"Serviço\",0,ROUND(SUMIF($F$9:$P$9,\"<>\",$F35:$P35),15-13*PO!$X$3))","v":8},8]
[{"$f":"OFFSET(PO!J$12,ROW(A36)-ROW($A$12),0)","v":"Serviço"},{"$f":"IF($A36=0,\"\",OFFSET(PO!K$12,ROW(B36)-ROW(B$12),0))","v":"1.4.2."},{"$f":"IF(OFFSET(PO!N$12,ROW(C36)-ROW(C$12),0)=0,\"\",OFFSET(PO!N$12,ROW(C36)-ROW(C$12),0))","v":"Regularização e compactação do sub-leito a 100% do PN"},{"$f":"IF(OFFSET(PO!O$12,ROW(D36)-ROW(D$12),0)=0,\"\",OFFSET(PO!O$12,ROW(D36)-ROW(D$12),0))","v":"m²"},{"$f":"IF($A36<>\"Serviço\",0,ROUND(SUMIF($F$9:$P$9,\"<>\",$F36:$P36),15-13*PO!$X$3))","v":32},32]
[{"$f":"OFFSET(PO!J$12,ROW(A37)-ROW($A$12),0)","v":"Serviço"},{"$f":"IF($A37=0,\"\",OFFSET(PO!K$12,ROW(B37)-ROW(B$12),0))","v":"1.4.3."},{"$f":"IF(OFFSET(PO!N$12,ROW(C37)-ROW(C$12),0)=0,\"\",OFFSET(PO!N$12,ROW(C37)-ROW(C$12),0))","v":"Sub base macadame hidraulico espessura = 15 cm"},{"$f":"IF(OFFSET(PO!O$12,ROW(D37)-ROW(D$12),0)=0,\"\",OFFSET(PO!O$12,ROW(D37)-ROW(D$12),0))","v":"m³"},{"$f":"IF($A37<>\"Serviço\",0,ROUND(SUMIF($F$9:$P$9,\"<>\",$F37:$P37),15-13*PO!$X$3))","v":4.8},4.8]
[{"$f":"OFFSET(PO!J$12,ROW(A38)-ROW($A$12),0)","v":"Serviço"},{"$f":"IF($A38=0,\"\",OFFSET(PO!K$12,ROW(B38)-ROW(B$12),0))","v":"1.4.4."},{"$f":"IF(OFFSET(PO!N$12,ROW(C38)-ROW(C$12),0)=0,\"\",OFFSET(PO!N$12,ROW(C38)-ROW(C$12),0))","v":"Base de brita graduada compactada - esp= 10 cm"},{"$f":"IF(OFFSET(PO!O$12,ROW(D38)-ROW(D$12),0)=0,\"\",OFFSET(PO!O$12,ROW(D38)-ROW(D$12),0))","v":"m³"},{"$f":"IF($A38<>\"Serviço\",0,ROUND(SUMIF($F$9:$P$9,\"<>\",$F38:$P38),15-13*PO!$X$3))","v":3.2},3.2]
[{"$f":"OFFSET(PO!J$12,ROW(A39)-ROW($A$12),0)","v":"Serviço"},{"$f":"IF($A39=0,\"\",OFFSET(PO!K$12,ROW(B39)-ROW(B$12),0))","v":"1.4.5."},{"$f":"IF(OFFSET(PO!N$12,ROW(C39)-ROW(C$12),0)=0,\"\",OFFSET(PO!N$12,ROW(C39)-ROW(C$12),0))","v":"Transporte de macadame hidraulico e brita graduada - DMT = 50 Km"},{"$f":"IF(OFFSET(PO!O$12,ROW(D39)-ROW(D$12),0)=0,\"\",OFFSET(PO!O$12,ROW(D39)-ROW(D$12),0))","v":"m³xkm"},{"$f":"IF($A39<>\"Serviço\",0,ROUND(SUMIF($F$9:$P$9,\"<>\",$F39:$P39),15-13*PO!$X$3))","v":400},400]
[{"$f":"OFFSET(PO!J$12,ROW(A40)-ROW($A$12),0)","v":"Serviço"},{"$f":"IF($A40=0,\"\",OFFSET(PO!K$12,ROW(B40)-ROW(B$12),0))","v":"1.4.6."},{"$f":"IF(OFFSET(PO!N$12,ROW(C40)-ROW(C$12),0)=0,\"\",OFFSET(PO!N$12,ROW(C40)-ROW(C$12),0))","v":"Imprimação da Base com asfalto diluído CM 30 - taxa = 1,2 L/m²"},{"$f":"IF(OFFSET(PO!O$12,ROW(D40)-ROW(D$12),0)=0,\"\",OFFSET(PO!O$12,ROW(D40)-ROW(D$12),0))","v":"m²"},{"$f":"IF($A40<>\"Serviço\",0,ROUND(SUMIF($F$9:$P$9,\"<>\",$F40:$P40),15-13*PO!$X$3))","v":32},32]
[{"$f":"OFFSET(PO!J$12,ROW(A41)-ROW($A$12),0)","v":"Serviço"},{"$f":"IF($A41=0,\"\",OFFSET(PO!K$12,ROW(B41)-ROW(B$12),0))","v":"1.4.7."},{"$f":"IF(OFFSET(PO!N$12,ROW(C41)-ROW(C$12),0)=0,\"\",OFFSET(PO!N$12,ROW(C41)-ROW(C$12),0))","v":"Transporte de material betuminoso CM 30 - DMT = 50 Km"},{"$f":"IF(OFFSET(PO!O$12,ROW(D41)-ROW(D$12),0)=0,\"\",OFFSET(PO!O$12,ROW(D41)-ROW(D$12),0))","v":"Txkm"},{"$f":"IF($A41<>\"Serviço\",0,ROUND(SUMIF($F$9:$P$9,\"<>\",$F41:$P41),15-13*PO!$X$3))","v":1.9},1.9]
[{"$f":"OFFSET(PO!J$12,ROW(A42)-ROW($A$12),0)","v":"Serviço"},{"$f":"IF($A42=0,\"\",OFFSET(PO!K$12,ROW(B42)-ROW(B$12),0))","v":"1.4.8."},{"$f":"IF(OFFSET(PO!N$12,ROW(C42)-ROW(C$12),0)=0,\"\",OFFSET(PO!N$12,ROW(C42)-ROW(C$12),0))","v":"Limpeza do pavimento"},{"$f":"IF(OFFSET(PO!O$12,ROW(D42)-ROW(D$12),0)=0,\"\",OFFSET(PO!O$12,ROW(D42)-ROW(D$12),0))","v":"m²"},{"$f":"IF($A42<>\"Serviço\",0,ROUND(SUMIF($F$9:$P$9,\"<>\",$F42:$P42),15-13*PO!$X$3))","v":4134},1507.3,1318.9,1307.8]
[{"$f":"OFFSET(PO!J$12,ROW(A43)-ROW($A$12),0)","v":"Serviço"},{"$f":"IF($A43=0,\"\",OFFSET(PO!K$12,ROW(B43)-ROW(B$12),0))","v":"1.4.9."},{"$f":"IF(OFFSET(PO!N$12,ROW(C43)-ROW(C$12),0)=0,\"\",OFFSET(PO!N$12,ROW(C43)-ROW(C$12),0))","v":"Pintura de Ligação com emulsão RR-2C - taxa = 0,50 L/m²"},{"$f":"IF(OFFSET(PO!O$12,ROW(D43)-ROW(D$12),0)=0,\"\",OFFSET(PO!O$12,ROW(D43)-ROW(D$12),0))","v":"m²"},{"$f":"IF($A43<>\"Serviço\",0,ROUND(SUMIF($F$9:$P$9,\"<>\",$F43:$P43),15-13*PO!$X$3))","v":4134},1507.3,1318.9,1307.8]
[{"$f":"OFFSET(PO!J$12,ROW(A44)-ROW($A$12),0)","v":"Serviço"},{"$f":"IF($A44=0,\"\",OFFSET(PO!K$12,ROW(B44)-ROW(B$12),0))","v":"1.4.10."},{"$f":"IF(OFFSET(PO!N$12,ROW(C44)-ROW(C$12),0)=0,\"\",OFFSET(PO!N$12,ROW(C44)-ROW(C$12),0))","v":"Pintura de Ligação com emulsão RR-2C - taxa = 0,30 L/m²"},{"$f":"IF(OFFSET(PO!O$12,ROW(D44)-ROW(D$12),0)=0,\"\",OFFSET(PO!O$12,ROW(D44)-ROW(D$12),0))","v":"m²"},{"$f":"IF($A44<>\"Serviço\",0,ROUND(SUMIF($F$9:$P$9,\"<>\",$F44:$P44),15-13*PO!$X$3))","v":4134},1507.3,1318.9,1307.8]
[{"$f":"OFFSET(PO!J$12,ROW(A45)-ROW($A$12),0)","v":"Serviço"},{"$f":"IF($A45=0,\"\",OFFSET(PO!K$12,ROW(B45)-ROW(B$12),0))","v":"1.4.11."},{"$f":"IF(OFFSET(PO!N$12,ROW(C45)-ROW(C$12),0)=0,\"\",OFFSET(PO!N$12,ROW(C45)-ROW(C$12),0))","v":"Transporte de material betuminoso RR-2C - DMT = 60 Km"},{"$f":"IF(OFFSET(PO!O$12,ROW(D45)-ROW(D$12),0)=0,\"\",OFFSET(PO!O$12,ROW(D45)-ROW(D$12),0))","v":"Txkm"},{"$f":"IF($A45<>\"Serviço\",0,ROUND(SUMIF($F$9:$P$9,\"<>\",$F45:$P45),15-13*PO!$X$3))","v":165.4},60.3,52.8,52.3]
[{"$f":"OFFSET(PO!J$12,ROW(A46)-ROW($A$12),0)","v":"Serviço"},{"$f":"IF($A46=0,\"\",OFFSET(PO!K$12,ROW(B46)-ROW(B$12),0))","v":"1.4.12."},{"$f":"IF(OFFSET(PO!N$12,ROW(C46)-ROW(C$12),0)=0,\"\",OFFSET(PO!N$12,ROW(C46)-ROW(C$12),0))","v":"Reperfilagem com concreto asfáltico usinado à quente (e= 4 cm)"},{"$f":"IF(OFFSET(PO!O$12,ROW(D46)-ROW(D$12),0)=0,\"\",OFFSET(PO!O$12,ROW(D46)-ROW(D$12),0))","v":"m³"},{"$f":"IF($A46<>\"Serviço\",0,ROUND(SUMIF($F$9:$P$9,\"<>\",$F46:$P46),15-13*PO!$X$3))","v":165.4},60.3,52.8,52.3]
[{"$f":"OFFSET(PO!J$12,ROW(A47)-ROW($A$12),0)","v":"Serviço"},{"$f":"IF($A47=0,\"\",OFFSET(PO!K$12,ROW(B47)-ROW(B$12),0))","v":"1.4.13."},{"$f":"IF(OFFSET(PO!N$12,ROW(C47)-ROW(C$12),0)=0,\"\",OFFSET(PO!N$12,ROW(C47)-ROW(C$12),0))","v":"Camada de concreto asfáltico usinado à quente (esp.= 3)"},{"$f":"IF(OFFSET(PO!O$12,ROW(D47)-ROW(D$12),0)=0,\"\",OFFSET(PO!O$12,ROW(D47)-ROW(D$12),0))","v":"m³"},{"$f":"IF($A47<>\"Serviço\",0,ROUND(SUMIF($F$9:$P$9,\"<>\",$F47:$P47),15-13*PO!$X$3))","v":124},45.2,39.6,39.200000000000003]
[{"$f":"OFFSET(PO!J$12,ROW(A48)-ROW($A$12),0)","v":"Serviço"},{"$f":"IF($A48=0,\"\",OFFSET(PO!K$12,ROW(B48)-ROW(B$12),0))","v":"1.4.14."},{"$f":"IF(OFFSET(PO!N$12,ROW(C48)-ROW(C$12),0)=0,\"\",OFFSET(PO!N$12,ROW(C48)-ROW(C$12),0))","v":"Transporte de massa asfáltica - DMT = 50 Km"},{"$f":"IF(OFFSET(PO!O$12,ROW(D48)-ROW(D$12),0)=0,\"\",OFFSET(PO!O$12,ROW(D48)-ROW(D$12),0))","v":"m³xkm"},{"$f":"IF($A48<>\"Serviço\",0,ROUND(SUMIF($F$9:$P$9,\"<>\",$F48:$P48),15-13*PO!$X$3))","v":14470},6330,4070,4070]
[{"$f":"OFFSET(PO!J$12,ROW(A49)-ROW($A$12),0)","v":"Serviço"},{"$f":"IF($A49=0,\"\",OFFSET(PO!K$12,ROW(B49)-ROW(B$12),0))","v":"1.4.15."},{"$f":"IF(OFFSET(PO!N$12,ROW(C49)-ROW(C$12),0)=0,\"\",OFFSET(PO!N$12,ROW(C49)-ROW(C$12),0))","v":"Retirada de meio-fio pré-moldado"},{"$f":"IF(OFFSET(PO!O$12,ROW(D49)-ROW(D$12),0)=0,\"\",OFFSET(PO!O$12,ROW(D49)-ROW(D$12),0))","v":"m"},{"$f":"IF($A49<>\"Serviço\",0,ROUND(SUMIF($F$9:$P$9,\"<>\",$F49:$P49),15-13*PO!$X$3))","v":237},237]
[{"$f":"OFFSET(PO!J$12,ROW(A50)-ROW($A$12),0)","v":"Serviço"},{"$f":"IF($A50=0,\"\",OFFSET(PO!K$12,ROW(B50)-ROW(B$12),0))","v":"1.4.16."},{"$f":"IF(OFFSET(PO!N$12,ROW(C50)-ROW(C$12),0)=0,\"\",OFFSET(PO!N$12,ROW(C50)-ROW(C$12),0))","v":"Assentamento de meio-fio pré-moldado"},{"$f":"IF(OFFSET(PO!O$12,ROW(D50)-ROW(D$12),0)=0,\"\",OFFSET(PO!O$12,ROW(D50)-ROW(D$12),0))","v":"m"},{"$f":"IF($A50<>\"Serviço\",0,ROUND(SUMIF($F$9:$P$9,\"<>\",$F50:$P50),15-13*PO!$X$3))","v":228},118,98,12]
[{"$f":"OFFSET(PO!J$12,ROW(A51)-ROW($A$12),0)","v":"Serviço"},{"$f":"IF($A51=0,\"\",OFFSET(PO!K$12,ROW(B51)-ROW(B$12),0))","v":"1.4.17."},{"$f":"IF(OFFSET(PO!N$12,ROW(C51)-ROW(C$12),0)=0,\"\",OFFSET(PO!N$12,ROW(C51)-ROW(C$12),0))","v":"Meio-fio pré-moldado 15 x 13 x 30 x 50 cm"},{"$f":"IF(OFFSET(PO!O$12,ROW(D51)-ROW(D$12),0)=0,\"\",OFFSET(PO!O$12,ROW(D51)-ROW(D$12),0))","v":"m"},{"$f":"IF($A51<>\"Serviço\",0,ROUND(SUMIF($F$9:$P$9,\"<>\",$F51:$P51),15-13*PO!$X$3))","v":53},48,null,5]
[{"$f":"OFFSET(PO!J$12,ROW(A52)-ROW($A$12),0)","v":"Serviço"},{"$f":"IF($A52=0,\"\",OFFSET(PO!K$12,ROW(B52)-ROW(B$12),0))","v":"1.4.18."},{"$f":"IF(OFFSET(PO!N$12,ROW(C52)-ROW(C$12),0)=0,\"\",OFFSET(PO!N$12,ROW(C52)-ROW(C$12),0))","v":"Ensaios e laudos atestando teor de cap, densidade, espessura. (A cada 50 m)"},{"$f":"IF(OFFSET(PO!O$12,ROW(D52)-ROW(D$12),0)=0,\"\",OFFSET(PO!O$12,ROW(D52)-ROW(D$12),0))","v":"m³"},{"$f":"IF($A52<>\"Serviço\",0,ROUND(SUMIF($F$9:$P$9,\"<>\",$F52:$P52),15-13*PO!$X$3))","v":289.39999999999998},105.5,92.3,91.6]
[{"$f":"OFFSET(PO!J$12,ROW(A53)-ROW($A$12),0)","v":"Nível 2"},{"$f":"IF($A53=0,\"\",OFFSET(PO!K$12,ROW(B53)-ROW(B$12),0))","v":"1.5."},{"$f":"IF(OFFSET(PO!N$12,ROW(C53)-ROW(C$12),0)=0,\"\",OFFSET(PO!N$12,ROW(C53)-ROW(C$12),0))","v":"SINALIZAÇÃO"},{"$f":"IF(OFFSET(PO!O$12,ROW(D53)-ROW(D$12),0)=0,\"\",OFFSET(PO!O$12,ROW(D53)-ROW(D$12),0))","v":""},{"$f":"IF($A53<>\"Serviço\",0,ROUND(SUMIF($F$9:$P$9,\"<>\",$F53:$P53),15-13*PO!$X$3))","v":0},0]
[{"$f":"OFFSET(PO!J$12,ROW(A54)-ROW($A$12),0)","v":"Serviço"},{"$f":"IF($A54=0,\"\",OFFSET(PO!K$12,ROW(B54)-ROW(B$12),0))","v":"1.5.1."},{"$f":"IF(OFFSET(PO!N$12,ROW(C54)-ROW(C$12),0)=0,\"\",OFFSET(PO!N$12,ROW(C54)-ROW(C$12),0))","v":"Pintura de faixa horizontal amarela - 10 cm"},{"$f":"IF(OFFSET(PO!O$12,ROW(D54)-ROW(D$12),0)=0,\"\",OFFSET(PO!O$12,ROW(D54)-ROW(D$12),0))","v":"m²"},{"$f":"IF($A54<>\"Serviço\",0,ROUND(SUMIF($F$9:$P$9,\"<>\",$F54:$P54),15-13*PO!$X$3))","v":45.5},17.399999999999999,14.3,13.8]
[{"$f":"OFFSET(PO!J$12,ROW(A55)-ROW($A$12),0)","v":"Serviço"},{"$f":"IF($A55=0,\"\",OFFSET(PO!K$12,ROW(B55)-ROW(B$12),0))","v":"1.5.2."},{"$f":"IF(OFFSET(PO!N$12,ROW(C55)-ROW(C$12),0)=0,\"\",OFFSET(PO!N$12,ROW(C55)-ROW(C$12),0))","v":"Pintura de faixa horizontal branca - 12 cm"},{"$f":"IF(OFFSET(PO!O$12,ROW(D55)-ROW(D$12),0)=0,\"\",OFFSET(PO!O$12,ROW(D55)-ROW(D$12),0))","v":"m²"},{"$f":"IF($A55<>\"Serviço\",0,ROUND(SUMIF($F$9:$P$9,\"<>\",$F55:$P55),15-13*PO!$X$3))","v":50.1},19,13.6,17.5]
[{"$f":"OFFSET(PO!J$12,ROW(A56)-ROW($A$12),0)","v":"Serviço"},{"$f":"IF($A56=0,\"\",OFFSET(PO!K$12,ROW(B56)-ROW(B$12),0))","v":"1.5.3."},{"$f":"IF(OFFSET(PO!N$12,ROW(C56)-ROW(C$12),0)=0,\"\",OFFSET(PO!N$12,ROW(C56)-ROW(C$12),0))","v":"Pintura de faixas de pedestres branca - 40 cm"},{"$f":"IF(OFFSET(PO!O$12,ROW(D56)-ROW(D$12),0)=0,\"\",OFFSET(PO!O$12,ROW(D56)-ROW(D$12),0))","v":"m²"},{"$f":"IF($A56<>\"Serviço\",0,ROUND(SUMIF($F$9:$P$9,\"<>\",$F56:$P56),15-13*PO!$X$3))","v":136.80000000000001},45.6,45.6,45.6]
[{"$f":"OFFSET(PO!J$12,ROW(A57)-ROW($A$12),0)","v":"Serviço"},{"$f":"IF($A57=0,\"\",OFFSET(PO!K$12,ROW(B57)-ROW(B$12),0))","v":"1.5.4."},{"$f":"IF(OFFSET(PO!N$12,ROW(C57)-ROW(C$12),0)=0,\"\",OFFSET(PO!N$12,ROW(C57)-ROW(C$12),0))","v":"Placa Octogonal \"PARE\" com L=25 cm - Totalmente refletiva, com suporte de aço galvanizado Ø 50 mm"},{"$f":"IF(OFFSET(PO!O$12,ROW(D57)-ROW(D$12),0)=0,\"\",OFFSET(PO!O$12,ROW(D57)-ROW(D$12),0))","v":"unid."},{"$f":"IF($A57<>\"Serviço\",0,ROUND(SUMIF($F$9:$P$9,\"<>\",$F57:$P57),15-13*PO!$X$3))","v":1},1]
[{"$f":"OFFSET(PO!J$12,ROW(A58)-ROW($A$12),0)","v":"Serviço"},{"$f":"IF($A58=0,\"\",OFFSET(PO!K$12,ROW(B58)-ROW(B$12),0))","v":"1.5.5."},{"$f":"IF(OFFSET(PO!N$12,ROW(C58)-ROW(C$12),0)=0,\"\",OFFSET(PO!N$12,ROW(C58)-ROW(C$12),0))","v":"Placa de Identificação de ruas - com suporte de aço galvanizado Ø 50 mm"},{"$f":"IF(OFFSET(PO!O$12,ROW(D58)-ROW(D$12),0)=0,\"\",OFFSET(PO!O$12,ROW(D58)-ROW(D$12),0))","v":"unid."},{"$f":"IF($A58<>\"Serviço\",0,ROUND(SUMIF($F$9:$P$9,\"<>\",$F58:$P58),15-13*PO!$X$3))","v":4},1,1,2]
[]
[]
[null,{"$f":"PO!$K$70","v":"Bom Jesus / SC"}]
[null,"Local"]
[]
[null,{"$f":"PO!$K$73","v":"2018-01-25"}]
[null,"Data"]

{"sheet":"CFF","index":4,"n_rows":27,"n_cols":29,"rows_kept":27,"cut":false,"hidden":false,"merged":[[7,11,7,12],[10,13,12,13],[17,12,19,12],[17,13,19,13],[24,16,24,18],[24,12,24,13],[23,16,23,18],[22,16,22,18],[22,11,22,13],[23,12,23,13],[25,11,25,13],[10,11,12,11],[10,12,12,12],[13,11,16,12],[13,13,16,13],[17,11,19,11]]}
[null,null,null,null,null,null,null,null,null,null,null,null,null,null,"    CFF -","CRONOGRAMA FÍSICO-FINANCEIRO"]
[null,null,null,null,null,null,null,null,null,null,null,null,null,null,null,{"$f":"CHOOSE(1+LOG(1+2*(TipoOrçamento=\"BASE\")+4*(TipoOrçamento=\"LICITADO\")+8*(TipoOrçamento=\"REPROGRAMADOAC\")+16*(TipoOrçamento=\"REPROGRAMADONPL\"),2),\"nada\",\"Cronograma Base para Licitação\",\"Cronograma Licitado\",\"Cronograma Licitado Reprogramado\",\"Cronograma Base para Licitação - Reprogramado\")","v":"Cronograma Base para Licitação"}]
[]
[]
[]
[]
[]
["Nível Máx Crono",null,null,null,null,null,null,null,null,null,null,{"$f":"IF(MAX($A$14:$A$22)<>MAX(PO!$V$12:$V$59),\"ERRO: CRONOGRAMA DESATUALIZADO\",IF(OR(COUNTIF($O$16:$X$16,\">1\")>0,OFFSET($X$17,0,-1)<>$N$14),\"ERRO: CRONOGRAMA NÃO FECHA EM 100%\",\"\"))","v":"ERRO: CRONOGRAMA DESATUALIZADO"},null,{"$f":"IF(TipoOrçamento=\"REPROGRAMADOAC\",\"Qtde de Medições realizadas\",\"\")","v":""}]
[2,null,null,null,null,null,null,null,null,null,null,null,null,1,{"$f":"IF(AND(TipoOrçamento=\"REPROGRAMADOAC\",$N$9>0),$N$9-1,0)","v":0},{"$f":"OFFSET(P9,0,-1)+1","v":1},2,3,4,5,6,7,8,null,null,null,null,null,{"$f":"OFFSET(AC9,0,-1)+1","v":1}]
["Lista Crono","Último Nível","Nível","Altura","N1","N2","N3","N4","Czero","Cnível","VTOTAL SOMA","Item","Descrição das Metas / Macrosserviços","Valores Totais (R$)",{"$f":"IF(TipoOrçamento=\"REPROGRAMADOAC\",\"Reinício de Obra\",\"Início de Obra\")&CHAR(10)&TEXT(DADOS!A48,\"dd/mm/aa\")","v":"Início de Obra\n01/12/17"},{"$f":"IF(AND(TipoOrçamento=\"REPROGRAMADOAC\",$N$9>0,N10=\"Valores Totais (R$)\"),\"Parcela \"&$N$9&\" Executado\",\"Parcela \"&P$9&CHAR(10)&TEXT(DATE(YEAR(DADOS!$A$48),MONTH(DADOS!$A$48)+P$9-IF(AND(TipoOrçamento=\"REPROGRAMADOAC\",$N$9>0),$N$9,0),1),\"mmm/aa\"))","v":"Parcela 1\njan/18"},{"$f":"IF(AND(TipoOrçamento=\"REPROGRAMADOAC\",$N$9>0,O10=\"Valores Totais (R$)\"),\"Parcela \"&$N$9&\" Executado\",\"Parcela \"&Q$9&CHAR(10)&TEXT(DATE(YEAR(DADOS!$A$48),MONTH(DADOS!$A$48)+Q$9-IF(AND(TipoOrçamento=\"REPROGRAMADOAC\",$N$9>0),$N$9,0),1),\"mmm/aa\"))","v":"Parcela 2\nfev/18"},{"$f":"IF(AND(TipoOrçamento=\"REPROGRAMADOAC\",$N$9>0,P10=\"Valores Totais (R$)\"),\"Parcela \"&$N$9&\" Executado\",\"Parcela \"&R$9&CHAR(10)&TEXT(DATE(YEAR(DADOS!$A$48),MONTH(DADOS!$A$48)+R$9-IF(AND(TipoOrçamento=\"REPROGRAMADOAC\",$N$9>0),$N$9,0),1),\"mmm/aa\"))","v":"Parcela 3\nmar/18"},{"$f":"IF(AND(TipoOrçamento=\"REPROGRAMADOAC\",$N$9>0,Q10=\"Valores Totais (R$)\"),\"Parcela \"&$N$9&\" Executado\",\"Parcela \"&S$9&CHAR(10)&TEXT(DATE(YEAR(DADOS!$A$48),MONTH(DADOS!$A$48)+S$9-IF(AND(TipoOrçamento=\"REPROGRAMADOAC\",$N$9>0),$N$9,0),1),\"mmm/aa\"))","v":"Parcela 4\nabr/18"},{"$f":"IF(AND(TipoOrçamento=\"REPROGRAMADOAC\",$N$9>0,R10=\"Valores Totais (R$)\"),\"Parcela \"&$N$9&\" Executado\",\"Parcela \"&T$9&CHAR(10)&TEXT(DATE(YEAR(DADOS!$A$48),MONTH(DADOS!$A$48)+T$9-IF(AND(TipoOrçamento=\"REPROGRAMADOAC\",$N$9>0),$N$9,0),1),\"mmm/aa\"))","v":"Parcela 5\nmai/18"},{"$f":"IF(AND(TipoOrçamento=\"REPROGRAMADOAC\",$N$9>0,S10=\"Valores Totais (R$)\"),\"Parcela \"&$N$9&\" Executado\",\"Parcela \"&U$9&CHAR(10)&TEXT(DATE(YEAR(DADOS!$A$48),MONTH(DADOS!$A$48)+U$9-IF(AND(TipoOrçamento=\"REPROGRAMADOAC\",$N$9>0),$N$9,0),1),\"mmm/aa\"))","v":"Parcela 6\njun/18"},{"$f":"IF(AND(TipoOrçamento=\"REPROGRAMADOAC\",$N$9>0,T10=\"Valores Totais (R$)\"),\"Parcela \"&$N$9&\" Executado\",\"Parcela \"&V$9&CHAR(10)&TEXT(DATE(YEAR(DADOS!$A$48),MONTH(DADOS!$A$48)+V$9-IF(AND(TipoOrçamento=\"REPROGRAMADOAC\",$N$9>0),$N$9,0),1),\"mmm/aa\"))","v":"Parcela 7\njul/18"},{"$f":"IF(AND(TipoOrçamento=\"REPROGRAMADOAC\",$N$9>0,U10=\"Valores Totais (R$)\"),\"Parcela \"&$N$9&\" Executado\",\"Parcela \"&W$9&CHAR(10)&TEXT(DATE(YEAR(DADOS!$A$48),MONTH(DADOS!$A$48)+W$9-IF(AND(TipoOrçamento=\"REPROGRAMADOAC\",$N$9>0),$N$9,0),1),\"mmm/aa\"))","v":"Parcela 8\nago/18"},null,null,null,null,null,{"$f":"IF(AND(TipoOrçamento=\"REPROGRAMADOAC\",$N$9>0,AA10=\"Valores Totais (R$)\"),\"Parcela \"&$N$9&\" Executado\",\"Parcela \"&AC$9&CHAR(10)&TEXT(DATE(YEAR(DADOS!$A$48),MONTH(DADOS!$A$48)+AC$9-IF(AND(TipoOrçamento=\"REPROGRAMADOAC\",$N$9>0),$N$9,0),1),\"mmm/aa\"))","v":"Parcela 1\njan/18"}]
[null,null,null,null,null,null,null,null,null,null,null,{"$f":"INDEX(PO!K$12:K$59,MATCH($A13,PO!$V$12:$V$59,0))","v":{"$error":"#VALUE!"}},{"$f":"INDEX(PO!N$12:N$59,MATCH($A13,PO!$V$12:$V$59,0))","v":{"$error":"#VALUE!"}},{"$f":"IF(ROUND(K13,2)=0,K13,ROUND(K13,2))","v":{"$error":"#VALUE!"}},"Parcela (%)",{"$f":"IF($B13,0,P12-IF(ISNUMBER(O12),O12,0))","v":{"$error":"#VALUE!"}},{"$f":"IF($B13,0,Q12-IF(ISNUMBER(P12),P12,0))","v":{"$error":"#VALUE!"}},{"$error":"#VALUE!"},{"$error":"#VALUE!"},{"$error":"#VALUE!"},{"$error":"#VALUE!"},{"$error":"#VALUE!"},{"$error":"#VALUE!"},null,null,null,null,null,{"$f":"IF($B13,0,AC12-IF(ISNUMBER(AB12),AB12,0))","v":{"$error":"#VALUE!"}}]
[null,null,null,null,null,null,null,null,null,null,null,null,null,null,"Acumulado (%)",{"$f":"MIN(IF($B13,P11+IF(ISNUMBER(O12),O12,0),P13/$N11),1)","v":{"$error":"#VALUE!"}},{"$f":"MIN(IF($B13,Q11+IF(ISNUMBER(P12),P12,0),Q13/$N11),1)","v":{"$error":"#VALUE!"}},{"$error":"#VALUE!"},{"$error":"#VALUE!"},{"$error":"#VALUE!"},{"$error":"#VALUE!"},{"$error":"#VALUE!"},{"$error":"#VALUE!"},null,null,null,null,null,{"$f":"MIN(IF($B13,AC11+IF(ISNUMBER(AB12),AB12,0),AC13/$N11),1)","v":{"$error":"#VALUE!"}}]
[{"$f":"OFFSET(A13,-CFF.NumLinha,0)+1","v":{"$error":"#VALUE!"}},{"$f":"$C13>=OFFSET($C13,CFF.NumLinha,0)","v":{"$error":"#VALUE!"}},{"$f":"INDEX(PO!A$12:A$59,MATCH($A13,PO!$V$12:$V$59,0))","v":{"$error":"#VALUE!"}},{"$f":"IF(ISERROR(J13),I13,SMALL(I13:J13,1))-1","v":{"$error":"#VALUE!"}},{"$f":"IF($C13=1,OFFSET(E13,-CFF.NumLinha,0)+1,OFFSET(E13,-CFF.NumLinha,0))","v":{"$error":"#VALUE!"}},{"$f":"IF($C13=1,0,IF($C13=2,OFFSET(F13,-CFF.NumLinha,0)+1,OFFSET(F13,-CFF.NumLinha,0)))","v":{"$error":"#VALUE!"}},{"$f":"IF(AND($C13<=2,$C13<>0),0,IF($C13=3,OFFSET(G13,-CFF.NumLinha,0)+1,OFFSET(G13,-CFF.NumLinha,0)))","v":{"$error":"#VALUE!"}},{"$f":"IF(AND($C13<=3,$C13<>0),0,IF($C13=4,OFFSET(H13,-CFF.NumLinha,0)+1,OFFSET(H13,-CFF.NumLinha,0)))","v":{"$error":"#VALUE!"}},{"$f":"MATCH(0,OFFSET($D13,1,$C13,ROW($A$21)-ROW($A13)),0)","v":{"$error":"#VALUE!"}},{"$f":"MATCH(OFFSET($D13,0,$C13)+1,OFFSET($D13,1,$C13,ROW($A$21)-ROW($A13)),0)","v":{"$error":"#VALUE!"}},{"$f":"ROUND(INDEX(PO!T$12:T$59,MATCH($A13,PO!$V$12:$V$59,0)),2)+10^-12","v":{"$error":"#VALUE!"}},null,null,null,"Acumulado (R$)",{"$f":"IF($B13,ROUND(P12*$N11,2),ROUND(SUMIF(OFFSET($B13,1,0,$D13),TRUE,OFFSET(P13,1,0,$D13))/SUMIF(OFFSET($B13,1,0,$D13),TRUE,OFFSET($K13,1,0,$D13))*$N11,2))","v":{"$error":"#VALUE!"}},{"$f":"IF($B13,ROUND(Q12*$N11,2),ROUND(SUMIF(OFFSET($B13,1,0,$D13),TRUE,OFFSET(Q13,1,0,$D13))/SUMIF(OFFSET($B13,1,0,$D13),TRUE,OFFSET($K13,1,0,$D13))*$N11,2))","v":{"$error":"#VALUE!"}},{"$error":"#VALUE!"},{"$error":"#VALUE!"},{"$error":"#VALUE!"},{"$error":"#VALUE!"},{"$error":"#VALUE!"},{"$error":"#VALUE!"},null,null,null,null,null,{"$f":"IF($B13,ROUND(AC12*$N11,2),ROUND(SUMIF(OFFSET($B13,1,0,$D13),TRUE,OFFSET(AC13,1,0,$D13))/SUMIF(OFFSET($B13,1,0,$D13),TRUE,OFFSET($K13,1,0,$D13))*$N11,2))","v":{"$error":"#VALUE!"}}]
[null,null,null,null,null,null,null,null,null,null,null,"CRONOGRAMA GLOBAL DO LOTE",null,{"$f":"IF(PO!$T$12=0,10^-12,PO!$T$12)","v":256995.36999999997},"Parcela (%)",{"$f":"ROUND(P15/$N14,4)","v":0},{"$f":"ROUND(Q15/$N14,4)","v":0},0,0,0,0,0,0,null,null,null,null,null,{"$f":"ROUND(AC15/$N14,4)","v":0}]
[null,null,null,null,null,null,null,null,null,null,null,null,null,null,"Parcela (R$)",{"$f":"P17-IF(ISNUMBER(O17),O17,0)","v":0},{"$f":"Q17-IF(ISNUMBER(P17),P17,0)","v":0},0,0,0,0,0,0,null,null,null,null,null,{"$f":"AC17-IF(ISNUMBER(AB17),AB17,0)","v":0}]
[null,null,null,null,null,null,null,null,null,null,null,null,null,null,"Acumulado (%)",{"$f":"ROUND(P17/$N14,4)","v":0},{"$f":"ROUND(Q17/$N14,4)","v":0},0,0,0,0,0,0,null,null,null,null,null,{"$f":"ROUND(AC17/$N14,4)","v":0}]
[0,null,null,{"$f":"ROW(D$21)-ROW(D18)","v":3},null,null,null,null,null,null,null,null,null,null,"Acumulado (R$)",{"$f":"SUMIF(OFFSET($C17,1,0):$C$21,1,OFFSET(P17,1,0):P$21)","v":0},{"$f":"SUMIF(OFFSET($C17,1,0):$C$21,1,OFFSET(Q17,1,0):Q$21)","v":0},{"$f":"SUMIF(OFFSET($C17,1,0):$C$21,1,OFFSET(R17,1,0):R$21)","v":0},{"$f":"SUMIF(OFFSET($C17,1,0):$C$21,1,OFFSET(S17,1,0):S$21)","v":0},{"$f":"SUMIF(OFFSET($C17,1,0):$C$21,1,OFFSET(T17,1,0):T$21)","v":0},{"$f":"SUMIF(OFFSET($C17,1,0):$C$21,1,OFFSET(U17,1,0):U$21)","v":0},{"$f":"SUMIF(OFFSET($C17,1,0):$C$21,1,OFFSET(V17,1,0):V$21)","v":0},{"$f":"SUMIF(OFFSET($C17,1,0):$C$21,1,OFFSET(W17,1,0):W$21)","v":0},null,null,null,null,null,{"$f":"SUMIF(OFFSET($C17,1,0):$C$21,1,OFFSET(AC17,1,0):AC$21)","v":0}]
[null,null,null,null,null,null,null,null,null,null,null,{"$f":"INDEX(PO!K$12:K$59,MATCH($A20,PO!$V$12:$V$59,0))","v":"1."},{"$f":"INDEX(PO!N$12:N$59,MATCH($A20,PO!$V$12:$V$59,0))","v":"PAVIMENTAÇÃO"},{"$f":"IF(ROUND(K20,2)=0,K20,ROUND(K20,2))","v":256995.37},"Parcela (%)",{"$f":"IF($B20,0,P19-IF(ISNUMBER(O19),O19,0))","v":0},0,0,0,0,0,0,0,"",null,null,null,null,{"$f":"IF($B20,0,AC19-IF(ISNUMBER(AB19),AB19,0))","v":0}]
[null,null,null,null,null,null,null,null,null,null,null,null,null,null,"Acumulado (%)",{"$f":"MIN(IF($B20,P18+IF(ISNUMBER(O19),O19,0),P20/$N18),1)","v":0},0,0,0,0,0,0,0,null,null,null,null,null,{"$f":"MIN(IF($B20,AC18+IF(ISNUMBER(AB19),AB19,0),AC20/$N18),1)","v":0}]
[{"$f":"OFFSET(A20,-CFF.NumLinha,0)+1","v":1},{"$f":"$C20>=OFFSET($C20,CFF.NumLinha,0)","v":true},{"$f":"INDEX(PO!A$12:A$59,MATCH($A20,PO!$V$12:$V$59,0))","v":1},{"$f":"IF(ISERROR(J20),I20,SMALL(I20:J20,1))-1","v":0},{"$f":"IF($C20=1,OFFSET(E20,-CFF.NumLinha,0)+1,OFFSET(E20,-CFF.NumLinha,0))","v":1},{"$f":"IF($C20=1,0,IF($C20=2,OFFSET(F20,-CFF.NumLinha,0)+1,OFFSET(F20,-CFF.NumLinha,0)))","v":0},{"$f":"IF(AND($C20<=2,$C20<>0),0,IF($C20=3,OFFSET(G20,-CFF.NumLinha,0)+1,OFFSET(G20,-CFF.NumLinha,0)))","v":0},{"$f":"IF(AND($C20<=3,$C20<>0),0,IF($C20=4,OFFSET(H20,-CFF.NumLinha,0)+1,OFFSET(H20,-CFF.NumLinha,0)))","v":0},{"$f":"MATCH(0,OFFSET($D20,1,$C20,ROW($A$21)-ROW($A20)),0)","v":1},{"$f":"MATCH(OFFSET($D20,0,$C20)+1,OFFSET($D20,1,$C20,ROW($A$21)-ROW($A20)),0)","v":{"$error":"#N/A"}},{"$f":"ROUND(INDEX(PO!T$12:T$59,MATCH($A20,PO!$V$12:$V$59,0)),2)+10^-12","v":256995.37},null,null,null,"Acumulado (R$)",{"$f":"IF($B20,ROUND(P19*$N18,2),ROUND(SUMIF(OFFSET($B20,1,0,$D20),TRUE,OFFSET(P20,1,0,$D20))/SUMIF(OFFSET($B20,1,0,$D20),TRUE,OFFSET($K20,1,0,$D20))*$N18,2))","v":0},0,0,0,0,0,0,0,null,null,null,null,null,{"$f":"IF($B20,ROUND(AC19*$N18,2),ROUND(SUMIF(OFFSET($B20,1,0,$D20),TRUE,OFFSET(AC20,1,0,$D20))/SUMIF(OFFSET($B20,1,0,$D20),TRUE,OFFSET($K20,1,0,$D20))*$N18,2))","v":0}]
[null,null,-1,null,0,0,0,0]
[]
[null,null,null,null,null,null,null,null,null,null,null,{"$f":"DADOS!I32","v":0}]
[null,null,null,null,null,null,null,null,null,null,null,"Local"]
[]
[null,null,null,null,null,null,null,null,null,null,null,{"$f":"PO!K73","v":"2018-01-25"}]
[null,null,null,null,null,null,null,null,null,null,null,"Data"]